{"text_format":"3","workbook":"xlsx","n_sheets":6,"sheets":["Matriz Calificación-Evaluación","INSTRUCTIVO","Matriz","Mapa Riesgo Inherente ","Mapa Riesgo Residual","Mapa de riesgo consolidado"],"not_rendered":{"charts":4,"images":5,"macros":1,"external_links":8,"defined_names":5,"pivot_tables":2},"read":"whole","date_system":"1900"}

{"sheet":"Matriz Calificación-Evaluación","index":0,"n_rows":11,"n_cols":11,"rows_kept":11,"hidden":true,"merged":[[1,3,1,7]]}
[]
[{"$nulls":3},"Matriz de Calificación evaluación y respuesta a los Riesgos."]
[]
[{"$nulls":4},"Impacto"]
[null,"Probabilidad",null,"Insignificante","Menor","Moderado ","Mayor ","Catastrófico"]
[{"$nulls":3},1,2,3,4,5]
[null,"Raro",1,"B","B","M","A","A",null,"B","Zona de Riesgo Baja"]
[null,"Improbable",2,"B","B","M","A","E",null,"M","Zona de Riesgo Moderada"]
[null,"Posible ",3,"B","M","A","E","E",null,"A","Zona de Riesgo Alta"]
[null,"Probable",4,"M","A","A","E","E",null,"E","Zona de Riesgo Extrema"]
[null,"casi seguro",5,"A","A","E","E","E"]

{"sheet":"INSTRUCTIVO","index":1,"n_rows":74,"n_cols":12,"rows_kept":74,"merged":[[0,0,0,1],[0,2,0,16],[2,1,14,1],[2,2,3,7],[2,8,14,8],[2,9,14,9],[2,10,2,16],[3,0,14,0],[3,10,13,15],[4,2,13,7],[14,2,14,7],[17,1,28,1],[17,2,18,7],[17,8,28,8],[17,9,28,9],[17,10,17,16],[18,0,28,0],[18,10,18,15],[19,2,27,7],[19,11,19,16],[20,11,20,16],[21,11,21,16],[22,10,22,15],[23,10,23,15],[24,11,24,14],[25,11,25,14],[26,11,26,14],[28,2,28,7],[29,1,52,1],[29,8,52,8],[29,9,52,9],[29,10,30,16],[30,0,52,0],[30,2,51,7],[53,0,71,0],[53,2,54,16],[55,2,56,16],[57,2,58,16],[59,2,59,16],[60,2,62,16],[63,2,64,15],[65,2,66,15],[67,2,71,15],[70,1,71,1],[73,0,73,16],[94,2,94,7]]}
[null,null,"Area Sistema Integrado de Gestión de la Calidad\nlnstructivo metodología administración de riesgos"]
[]
["PASO 1"]
[{"$nulls":10},"La Universidad del Cauca en su compromiso vital y permanente con el desarrollo social, mediante la educación crítica, responsable y creativa, propone gestionar los riesgos institucionales, incluidos los riesgos de corrupción, definiendo medidas encaminadas a evitar, prevenir, mitigar, compartir o transferir aquellos de mayor probabilidad de ocurrencia y que generan un impacto considerable en el cumplimiento de los objetivos institucionales, realizando un seguimiento periódico a la efectividad de los controles, contando para ello con personal comprometido con el mejoramiento continuo de sus procesos y de la gestión Institucional. "]
[null,null,"POLITICA DE ADMINISTRACIÓN DEL RIESGO\n"]
{"$rows_empty":12}
["PASO 2"]
[{"$nulls":10},"2.1 Establecimiento del contexto"]
[null,null,"IDENTIFICACIÓN DEL RIESGO",{"$nulls":8},"Establecimiento del contexto interno"]
[{"$nulls":11},"Establecimiento del contexto externo"]
[{"$nulls":11},"Establecimiento del contexto delproceso"]
[]
[{"$nulls":10},"2.1 Identificación del riesgo"]
[{"$nulls":11},"Causas "]
[{"$nulls":11},"Riesgo"]
[{"$nulls":11},"Consecuencias o impactos"]
[]
[]
["ETAPA 3"]
["Valoración\ndel Riesgo",null,"VALORACIÓN  DEL RIESGO"]
{"$rows_empty":22}
["MARCO CONCEPTUAL",null,"Riesgo: Posibilidad de que ocurra un acontecimiento que impacte el alcance de los objetivos y resultados de la Institución "]
[]
[null,null,"Clase: Determine qué clase de riesgo es el identificado, de acuerdo a la siguiente clasificación: Estratégico, Imagen, Operacional, Financiero, Contable, Presupuestal, Cumplimiento, Tecnología, Información, Transparencia, Laborales, Ambiental, Derechos Humanos."]
[]
[null,null,"Descripción: se refiere a las características generales o las formas en que se observa o manifiesta el riesgo identificado."]
[]
[null,null,"Efecto: Corresponde a las consecuencias ocasionadas por el riesgo."]
[null,null,"Causas:  Es lo que origina el riesgo, son el punto de partida para el planteamiento de acciones preventivas. Las causas se deben establecer a partir de los factores internos y externos que se establecieron en el contexto. Para determinar las causas se podrá utilizar el diagrama causa - efecto."]
[]
[]
[null,null,"Una vez ubicados los riesgos en la matriz de priorización, se identifica si existen controles asociados, si son aplicados, están documentados y son efectivos, con el fin de determinar la posición del riesgo en la matriz de vulnerabilidad."]
[]
[null,null,"Control:  Es toda acción que tiende a prevenir o mitigar los riesgos, significa analizar el desempeño de los procesos, evidenciando posibles desviaciones frente al resultado esperado. Los controles proporcionan un modelo operacional de seguridad razonable en el logro de los objetivos. Tipos:"]
[]
[null,null,"Tipos de Control:\nDetectivo: se diseñan para identificar si resultados indeseables han ocurrido después de un acontecimiento.\nPreventivo: aquellos que actúan para eliminar las causas del riesgo, para prevenir su ocurrencia o materialización.\nCorrectivos: aquellos que permiten el restablecimiento de la actividad después de ser detectado un evento no deseable; también permiten la modificación de las acciones que propiciaron su ocurrencia."]
[]
[]
[]
[]
[]
["Algunas de las acciones tienden  a controlar la Posibilidad/Probabilidad y otras el impacto Son:"]

{"sheet":"Matriz","index":2,"n_rows":470,"n_cols":106,"rows_kept":470,"merged":[[0,0,3,2],[0,3,3,20],[4,0,4,2],[4,3,4,4],[4,6,4,14],[4,16,4,20],[5,0,5,6],[5,7,5,57],[6,0,6,3],[6,4,6,6],[6,7,6,13],[6,14,6,34],[6,42,6,47],[6,48,6,57],[7,7,7,8],[7,10,7,11],[7,12,7,13],[7,18,7,19],[7,20,7,21],[7,22,7,23],[7,24,7,25],[7,26,7,27],[7,28,7,29],[7,30,7,31],[7,35,7,36],[7,37,7,38],[7,40,7,41],[7,61,7,63],[8,0,16,0],[8,5,16,5],[8,7,16,7],[8,8,16,8],[8,9,16,9],[8,10,16,10],[8,11,16,11],[8,12,16,12],[8,13,16,13],[8,35,16,35],[8,36,16,36],[8,37,16,37],[8,38,16,38],[8,39,16,39],[8,40,16,40],[8,41,16,41],[8,48,16,48],[8,50,16,50],[8,53,16,53],[8,54,16,54],[8,55,16,55],[8,56,16,56],[8,57,16,57],[8,70,8,72],[8,74,8,77],[8,79,8,80],[8,93,9,93],[17,0,25,0],[17,5,25,5],[17,7,25,7],[17,8,25,8],[17,9,25,9],[17,10,25,10],[17,11,25,11],[17,12,25,12],[17,13,25,13],[17,35,25,35],[17,36,25,36],[17,37,25,37],[17,38,25,38],[17,39,25,39],[17,40,25,40],[17,41,25,41],[17,48,25,48],[17,50,25,50],[17,53,25,53],[17,54,25,54],[17,55,25,55],[17,56,25,56],[17,57,25,57],[26,0,34,0],[26,5,34,5],[26,7,34,7],[26,8,34,8],[26,9,34,9],[26,10,34,10],[26,11,34,11],[26,12,34,12],[26,13,34,13],[26,35,34,35],[26,36,34,36],[26,37,34,37],[26,38,34,38],[26,39,34,39],[26,40,34,40],[26,41,34,41],[26,48,34,48],[26,50,34,50],[26,53,34,53],[26,54,34,54],[26,55,34,55],[26,56,34,56],[26,57,34,57],[35,0,43,0],[35,5,43,5],[35,7,43,7],[35,8,43,8],[35,9,43,9],[35,10,43,10],[35,11,43,11],[35,12,43,12],[35,13,43,13],[35,35,43,35],[35,36,43,36],[35,37,43,37],[35,38,43,38],[35,39,43,39],[35,40,43,40],[35,41,43,41],[35,48,43,48],[35,50,43,50],[35,53,43,53],[35,54,43,54],[35,55,43,55],[35,56,43,56],[35,57,43,57],[44,0,52,0],[44,5,52,5],[44,7,52,7],[44,8,52,8],[44,9,52,9],[44,10,52,10],[44,11,52,11],[44,12,52,12],[44,13,52,13],[44,35,52,35],[44,36,52,36],[44,37,52,37],[44,38,52,38],[44,39,52,39],[44,40,52,40],[44,41,52,41],[44,48,52,48],[44,50,52,50],[44,53,52,53],[44,54,52,54],[44,55,52,55],[44,56,52,56],[44,57,52,57],[53,0,61,0],[53,5,61,5],[53,7,61,7],[53,8,61,8],[53,9,61,9],[53,10,61,10],[53,11,61,11],[53,12,61,12],[53,13,61,13],[53,35,61,35],[53,36,61,36],[53,37,61,37],[53,38,61,38],[53,39,61,39],[53,40,61,40],[53,41,61,41],[53,48,61,48],[53,50,61,50],[53,53,61,53],[53,54,61,54],[53,55,61,55],[53,56,61,56],[53,57,61,57],[62,0,70,0],[62,5,70,5],[62,7,70,7],[62,8,70,8],[62,9,70,9],[62,10,70,10],[62,11,70,11],[62,12,70,12],[62,13,70,13],[62,35,70,35],[62,36,70,36],[62,37,70,37],[62,38,70,38],[62,39,70,39],[62,40,70,40],[62,41,70,41],[62,48,70,48],[62,50,70,50],[62,53,70,53],[62,54,70,54],[62,55,70,55],[62,56,70,56],[62,57,70,57],[71,0,79,0],[71,5,79,5],[71,7,79,7],[71,8,79,8],[71,9,79,9],[71,10,79,10],[71,11,79,11],[71,12,79,12],[71,13,79,13],[71,35,79,35],[71,36,79,36],[71,37,79,37],[71,38,79,38],[71,39,79,39],[71,40,79,40],[71,41,79,41],[71,48,79,48],[71,50,79,50],[71,53,79,53],[71,54,79,54],[71,55,79,55],[71,56,79,56],[71,57,79,57],[80,0,88,0],[80,5,88,5],[80,7,88,7],[80,8,88,8],[80,9,88,9],[80,10,88,10],[80,11,88,11],[80,12,88,12],[80,13,88,13],[80,35,88,35],[80,36,88,36],[80,37,88,37],[80,38,88,38],[80,39,88,39],[80,40,88,40],[80,41,88,41],[80,48,88,48],[80,50,88,50],[80,53,88,53],[80,54,88,54],[80,55,88,55],[80,56,88,56],[80,57,88,57],[89,0,97,0],[89,5,97,5],[89,7,97,7],[89,8,97,8],[89,9,97,9],[89,10,97,10],[89,11,97,11],[89,12,97,12],[89,13,97,13],[89,35,97,35],[89,36,97,36],[89,37,97,37],[89,38,97,38],[89,39,97,39],[89,40,97,40],[89,41,97,41],[89,48,97,48],[89,50,97,50],[89,53,97,53],[89,54,97,54],[89,55,97,55],[89,56,97,56],[89,57,97,57],[98,0,106,0],[98,5,106,5],[98,7,106,7],[98,8,106,8],[98,9,106,9],[98,10,106,10],[98,11,106,11],[98,12,106,12],[98,13,106,13],[98,35,106,35],[98,36,106,36],[98,37,106,37],[98,38,106,38],[98,39,106,39],[98,40,106,40],[98,41,106,41],[98,48,106,48],[98,50,106,50],[98,53,106,53],[98,54,106,54],[98,55,106,55],[98,56,106,56],[98,57,106,57],[107,0,115,0],[107,5,115,5],[107,7,115,7],[107,8,115,8],[107,9,115,9],[107,10,115,10],[107,11,115,11],[107,12,115,12],[107,13,115,13],[107,35,115,35],[107,36,115,36],[107,37,115,37],[107,38,115,38],[107,39,115,39],[107,40,115,40],[107,41,115,41],[107,48,115,48],[107,50,115,50],[107,53,115,53],[107,54,115,54],[107,55,115,55],[107,56,115,56],[107,57,115,57],[116,0,124,0],[116,5,124,5],[116,7,124,7],[116,8,124,8],[116,9,124,9],[116,10,124,10],[116,11,124,11],[116,12,124,12],[116,13,124,13],[116,35,124,35],[116,36,124,36],[116,37,124,37],[116,38,124,38],[116,39,124,39],[116,40,124,40],[116,41,124,41],[116,48,124,48],[116,50,124,50],[116,53,124,53],[116,54,124,54],[116,55,124,55],[116,56,124,56],[116,57,124,57],[125,0,133,0],[125,5,133,5],[125,7,133,7],[125,8,133,8],[125,9,133,9],[125,10,133,10],[125,11,133,11],[125,12,133,12],[125,13,133,13],[125,35,133,35],[125,36,133,36],[125,37,133,37],[125,38,133,38],[125,39,133,39],[125,40,133,40],[125,41,133,41],[125,48,133,48],[125,50,133,50],[125,53,133,53],[125,54,133,54],[125,55,133,55],[125,56,133,56],[125,57,133,57],[134,0,142,0],[134,5,142,5],[134,7,142,7],[134,8,142,8],[134,9,142,9],[134,10,142,10],[134,11,142,11],[134,12,142,12],[134,13,142,13],[134,35,142,35],[134,36,142,36],[134,37,142,37],[134,38,142,38],[134,39,142,39],[134,40,142,40],[134,41,142,41],[134,48,142,48],[134,50,142,50],[134,53,142,53],[134,54,142,54],[134,55,142,55],[134,56,142,56],[134,57,142,57],[143,0,151,0],[143,5,151,5],[143,7,151,7],[143,8,151,8],[143,9,151,9],[143,10,151,10],[143,11,151,11],[143,12,151,12],[143,13,151,13],[143,35,151,35],[143,36,151,36],[143,37,151,37],[143,38,151,38],[143,39,151,39],[143,40,151,40],[143,41,151,41],[143,48,151,48],[143,50,151,50],[143,53,151,53],[143,54,151,54],[143,55,151,55],[143,56,151,56],[143,57,151,57],[152,0,160,0],[152,5,160,5],[152,7,160,7],[152,8,160,8],[152,9,160,9],[152,10,160,10],[152,11,160,11],[152,12,160,12],[152,13,160,13],[152,35,160,35],[152,36,160,36],[152,37,160,37],[152,38,160,38],[152,39,160,39],[152,40,160,40],[152,41,160,41],[152,48,160,48],[152,50,160,50],[152,53,160,53],[152,54,160,54],[152,55,160,55],[152,56,160,56],[152,57,160,57],[161,0,169,0],[161,5,169,5],[161,7,169,7],[161,8,169,8],[161,9,169,9],[161,10,169,10],[161,11,169,11],[161,12,169,12],[161,13,169,13],[161,35,169,35],[161,36,169,36],[161,37,169,37],[161,38,169,38],[161,39,169,39],[161,40,169,40],[161,41,169,41],[161,48,169,48],[161,50,169,50],[161,53,169,53],[161,54,169,54],[161,55,169,55],[161,56,169,56],[161,57,169,57],[170,0,178,0],[170,5,178,5],[170,7,178,7],[170,8,178,8],[170,9,178,9],[170,10,178,10],[170,11,178,11],[170,12,178,12],[170,13,178,13],[170,35,178,35],[170,36,178,36],[170,37,178,37],[170,38,178,38],[170,39,178,39],[170,40,178,40],[170,41,178,41],[170,48,178,48],[170,50,178,50],[170,53,178,53],[170,54,178,54],[170,55,178,55],[170,56,178,56],[170,57,178,57],[179,0,187,0],[179,5,187,5],[179,7,187,7],[179,8,187,8],[179,9,187,9],[179,10,187,10],[179,11,187,11],[179,12,187,12],[179,13,187,13],[179,35,187,35],[179,36,187,36],[179,37,187,37],[179,38,187,38],[179,39,187,39],[179,40,187,40],[179,41,187,41],[179,48,187,48],[179,50,187,50],[179,53,187,53],[179,54,187,54],[179,55,187,55],[179,56,187,56],[179,57,187,57],[188,0,196,0],[188,5,196,5],[188,7,196,7],[188,8,196,8],[188,9,196,9],[188,10,196,10],[188,11,196,11],[188,12,196,12],[188,13,196,13],[188,35,196,35],[188,36,196,36],[188,37,196,37],[188,38,196,38],[188,39,196,39],[188,40,196,40],[188,41,196,41],[188,48,196,48],[188,50,196,50],[188,53,196,53],[188,54,196,54],[188,55,196,55],[188,56,196,56],[188,57,196,57],[197,0,205,0],[197,5,205,5],[197,7,205,7],[197,8,205,8],[197,9,205,9],[197,10,205,10],[197,11,205,11],[197,12,205,12],[197,13,205,13],[197,35,205,35],[197,36,205,36],[197,37,205,37],[197,38,205,38],[197,39,205,39],[197,40,205,40],[197,41,205,41],[197,48,205,48],[197,50,205,50],[197,53,205,53],[197,54,205,54],[197,55,205,55],[197,56,205,56],[197,57,205,57],[206,0,214,0],[206,5,214,5],[206,7,214,7],[206,8,214,8],[206,9,214,9],[206,10,214,10],[206,11,214,11],[206,12,214,12],[206,13,214,13],[206,35,214,35],[206,36,214,36],[206,37,214,37],[206,38,214,38],[206,39,214,39],[206,40,214,40],[206,41,214,41],[206,48,214,48],[206,50,214,50],[206,53,214,53],[206,54,214,54],[206,55,214,55],[206,56,214,56],[206,57,214,57],[215,0,223,0],[215,5,223,5],[215,7,223,7],[215,8,223,8],[215,9,223,9],[215,10,223,10],[215,11,223,11],[215,12,223,12],[215,13,223,13],[215,35,223,35],[215,36,223,36],[215,37,223,37],[215,38,223,38],[215,39,223,39],[215,40,223,40],[215,41,223,41],[215,48,223,48],[215,50,223,50],[215,53,223,53],[215,54,223,54],[215,55,223,55],[215,56,223,56],[215,57,223,57],[224,0,232,0],[224,5,232,5],[224,7,232,7],[224,8,232,8],[224,9,232,9],[224,10,232,10],[224,11,232,11],[224,12,232,12],[224,13,232,13],[224,35,232,35],[224,36,232,36],[224,37,232,37],[224,38,232,38],[224,39,232,39],[224,40,232,40],[224,41,232,41],[224,48,232,48],[224,50,232,50],[224,53,232,53],[224,54,232,54],[224,55,232,55],[224,56,232,56],[224,57,232,57],[233,0,241,0],[233,4,234,4],[233,5,241,5],[233,6,234,6],[233,7,241,7],[233,8,241,8],[233,9,241,9],[233,10,241,10],[233,11,241,11],[233,12,241,12],[233,13,241,13],[233,35,241,35],[233,36,241,36],[233,37,241,37],[233,38,241,38],[233,39,241,39],[233,40,241,40],[233,41,241,41],[233,48,241,48],[233,50,241,50],[233,53,241,53],[233,54,241,54],[233,55,241,55],[233,57,241,57],[242,0,250,0],[242,5,250,5],[242,7,250,7],[242,8,250,8],[242,9,250,9],[242,10,250,10],[242,11,250,11],[242,12,250,12],[242,13,250,13],[242,35,250,35],[242,36,250,36],[242,37,250,37],[242,38,250,38],[242,39,250,39],[242,40,250,40],[242,41,250,41],[242,48,250,48],[242,50,250,50],[242,53,250,53],[242,54,250,54],[242,57,250,57],[251,0,259,0],[251,13,259,13],[251,35,259,35],[251,36,259,36],[251,37,259,37],[251,38,259,38],[251,39,259,39],[251,40,259,40],[251,41,259,41],[251,48,259,48],[251,50,259,50],[251,53,259,53],[251,54,259,54],[251,57,259,57],[260,0,268,0],[260,35,268,35],[260,36,268,36],[260,37,268,37],[260,38,268,38],[260,39,268,39],[260,40,268,40],[260,41,268,41],[260,48,268,48],[260,50,268,50],[260,53,268,53],[260,54,268,54],[260,57,268,57],[269,0,277,0],[269,35,277,35],[269,36,277,36],[269,37,277,37],[269,38,277,38],[269,39,277,39],[269,40,277,40],[269,41,277,41],[269,48,277,48],[269,50,277,50],[269,53,277,53],[269,54,277,54],[269,57,277,57],[278,0,286,0],[278,5,286,5],[278,35,286,35],[278,36,286,36],[278,37,286,37],[278,38,286,38],[278,39,286,39],[278,40,286,40],[278,41,286,41],[278,48,286,48],[278,50,286,50],[278,53,286,53],[278,54,286,54],[278,57,286,57],[287,0,295,0],[287,5,295,5],[287,35,295,35],[287,36,295,36],[287,37,295,37],[287,38,295,38],[287,39,295,39],[287,40,295,40],[287,41,295,41],[287,48,295,48],[287,50,295,50],[287,53,295,53],[287,54,295,54],[287,55,295,55],[287,57,295,57],[296,0,304,0],[296,5,304,5],[296,7,304,7],[296,8,304,8],[296,10,304,10],[296,11,304,11],[296,12,304,12],[296,13,304,13],[296,35,304,35],[296,36,304,36],[296,37,304,37],[296,38,304,38],[296,39,304,39],[296,40,304,40],[296,41,304,41],[296,48,304,48],[296,50,304,50],[296,53,304,53],[296,54,304,54],[296,55,304,55],[296,57,304,57],[305,0,313,0],[305,5,313,5],[305,7,313,7],[305,8,313,8],[305,9,313,9],[305,10,313,10],[305,11,313,11],[305,12,313,12],[305,35,313,35],[305,36,313,36],[305,37,313,37],[305,38,313,38],[305,39,313,39],[305,40,313,40],[305,41,313,41],[305,48,313,48],[305,50,313,50],[305,53,313,53],[305,54,313,54],[305,55,313,55],[305,57,313,57],[314,0,322,0],[314,35,322,35],[314,36,322,36],[314,37,322,37],[314,38,322,38],[314,39,322,39],[314,40,322,40],[314,41,322,41],[314,48,322,48],[314,50,322,50],[314,53,322,53],[314,54,322,54],[314,55,322,55],[314,57,322,57],[323,0,331,0],[323,9,331,9],[323,10,331,10],[323,11,331,11],[323,12,331,12],[323,13,331,13],[323,35,331,35],[323,36,331,36],[323,37,331,37],[323,38,331,38],[323,39,331,39],[323,40,331,40],[323,41,331,41],[323,48,331,48],[323,50,331,50],[323,53,331,53],[323,54,331,54],[323,55,331,55],[323,57,331,57],[332,0,340,0],[332,13,340,13],[332,35,340,35],[332,36,340,36],[332,37,340,37],[332,38,340,38],[332,39,340,39],[332,40,340,40],[332,41,340,41],[332,48,340,48],[332,50,340,50],[332,53,340,53],[332,54,340,54],[332,55,340,55],[332,57,340,57],[341,0,349,0],[341,5,349,5],[341,7,349,7],[341,8,349,8],[341,9,349,9],[341,10,349,10],[341,11,349,11],[341,12,349,12],[341,13,349,13],[341,35,349,35],[341,36,349,36],[341,37,349,37],[341,38,349,38],[341,39,349,39],[341,40,349,40],[341,41,349,41],[341,48,349,48],[341,50,349,50],[341,53,349,53],[341,54,349,54],[341,55,349,55],[341,57,349,57],[350,0,358,0],[350,5,358,5],[350,7,358,7],[350,8,358,8],[350,9,358,9],[350,10,358,10],[350,11,358,11],[350,12,358,12],[350,13,358,13],[350,35,358,35],[350,36,358,36],[350,37,358,37],[350,38,358,38],[350,39,358,39],[350,40,358,40],[350,41,358,41],[350,48,358,48],[350,50,358,50],[350,53,358,53],[350,54,358,54],[350,55,358,55],[350,57,358,57],[359,0,367,0],[359,5,367,5],[359,7,367,7],[359,8,367,8],[359,9,367,9],[359,10,367,10],[359,11,367,11],[359,12,367,12],[359,13,367,13],[359,35,367,35],[359,48,367,48],[359,50,367,50],[359,53,367,53],[359,54,367,54],[359,55,367,55],[359,57,367,57],[368,0,376,0],[368,5,376,5],[368,7,376,7],[368,8,376,8],[368,9,376,9],[368,10,376,10],[368,11,376,11],[368,12,376,12],[368,13,376,13],[368,35,376,35],[368,48,376,48],[368,50,376,50],[368,53,376,53],[368,54,376,54],[368,55,376,55],[368,57,376,57],[377,0,385,0],[377,5,385,5],[377,7,385,7],[377,8,385,8],[377,9,385,9],[377,10,385,10],[377,11,385,11],[377,12,385,12],[377,13,385,13],[377,48,385,48],[377,50,385,50],[377,53,385,53],[377,54,385,54],[377,55,385,55],[377,57,385,57],[386,0,394,0],[386,5,394,5],[386,7,394,7],[386,8,394,8],[386,9,394,9],[386,10,394,10],[386,11,394,11],[386,12,394,12],[386,13,394,13],[386,48,394,48],[386,50,394,50],[386,53,394,53],[386,54,394,54],[386,55,394,55],[386,57,394,57],[395,0,403,0],[395,5,403,5],[395,7,403,7],[395,8,403,8],[395,9,403,9],[395,10,403,10],[395,11,403,11],[395,12,403,12],[395,13,403,13],[395,48,403,48],[395,50,403,50],[395,53,403,53],[395,54,403,54],[395,55,403,55],[395,57,403,57],[404,0,412,0],[404,5,412,5],[404,7,412,7],[404,8,412,8],[404,9,412,9],[404,10,412,10],[404,11,412,11],[404,12,412,12],[404,13,412,13],[404,48,412,48],[404,50,412,50],[404,53,412,53],[404,54,412,54],[404,55,412,55],[404,57,412,57],[413,0,421,0],[413,5,421,5],[413,7,421,7],[413,8,421,8],[413,9,421,9],[413,10,421,10],[413,11,421,11],[413,12,421,12],[413,13,421,13],[413,48,421,48],[413,50,421,50],[413,53,421,53],[413,54,421,54],[413,55,421,55],[413,57,421,57],[422,0,430,0],[422,5,430,5],[422,7,430,7],[422,8,430,8],[422,9,430,9],[422,10,430,10],[422,11,430,11],[422,12,430,12],[422,13,430,13],[422,48,430,48],[422,50,430,50],[422,53,430,53],[422,54,430,54],[422,55,430,55],[422,57,430,57],[431,0,439,0],[431,5,439,5],[431,7,439,7],[431,8,439,8],[431,9,439,9],[431,10,439,10],[431,11,439,11],[431,12,439,12],[431,13,439,13],[431,48,439,48],[431,50,439,50],[431,53,439,53],[431,54,439,54],[431,55,439,55],[431,57,439,57],[440,2,440,5],[440,6,440,47],[441,2,441,5],[441,6,441,47],[442,2,442,5],[442,6,442,47],[463,2,463,3],[463,5,463,6]],"merged_total":1062,"flags":["merged_cut"]}
[{"$nulls":3},"Area Sistema Integrado de Gestión de la Calidad\nAdministración del Riesgo y Autovaloración del Control"]
[]
[]
[]
["PROCESO:",null,null,"GESTIÓN ADMINISTRATIVA",null,"OBJETIVO","Apoyar administrativamente de forma efectiva el desarrollo de las actividades misionales\nuniiversitarias, mediante la gestión de los recursos humanos, financieros, fisicos y\ntecnologicos",{"$nulls":8},"ALCANCE","Aplica para todas las áreas administrativas de la Universidad del Cauca"]
["IDENTIFICACION DEL RIESGO",{"$nulls":6},"VALORACION DEL RIESGO"]
["ANALISIS CONTEXTO",{"$nulls":3},"IDENTIFICACION DEL RIESGO",null,null,"ANALISIS DEL RIESGO",{"$nulls":6},"VALORACIÓN/EVALUACION DEL RIESGO",{"$nulls":27},"MONITOREO Y REVISION",{"$nulls":5},"RIESGO RESIDUAL"]
["ITEM","N°","TIPO","CLASIFICACION","CAUSAS","RIESGO","CONSECUENCIAS","PROBABILIDAD",null,null,"IMPACTO",null,"NIVEL DE RIESGO","CONTEO NIVEL DE RIESGO","TIPO DE CONTROL","CONTROL ESTABLECIDO\n","FRECUENCIA DEL CONTROL","El control previene la materialización del riesgo (afecta probabilidad) o permite enfrentar la situación en caso de materialización (afecta impacto)?","¿Existen manuales, instructivos o procedimientos para el manejo del control?",null,"¿Está (n) definido (s) el (los) responsable (s) de la ejecución del control y del seguimiento?",null,"¿El control es automático?",null,"¿El control es manual?",null,"¿La frecuencia de ejecución del control y seguimiento es adecuada?",null,"¿Se cuenta con evidencias de la ejecución y seguimiento del control?",null,"¿En el tiempo que lleva el control  ha demostrado ser efectiva?",null,"TOTAL","Efectos en la  Probabilidad/Impacto","Valor del Impacto","PROBABILIDAD RESIDUAL",null,"IMPACTO RESIDUAL",null,null,"NIVEL DE RIESGO","CONTEO NIVEL DE RIESGO","OBSERVACIONES A LOS CONTROLES","ACCIONES","RESPONSABLE","FECHA INICIO","FECHA TERMINACIÓN","REGISTROS","PROBABILIDAD","PROBABILIDAD AJUSTADA","IMPACTO","IMPACTO AJUSTADO","Nuevo nivel de Desplazamiento en Probabilidad/Impacto","NUMERO TOTAL DE DESPLAZAMIENTOS POR PROBABILIDAD","NUMERO TOTAL DE DESPLAZAMIENTOS POR IMPACTO","PROBABILIDAD CON DEZPLAZAMIENTOS",null,"IMPACTO CON DESPLAZAMIENTOS",{"$nulls":3},"Contexto"]
["R1",1,"Factor_Externo","Económicos","Falta de presupuesto o asignación de CDP","Pérdida de conectividad a Internet","Navegación a internet interrumpida",5,{"$f":"IF(H9=5,\"Mas de una vez al año\",IF(H9=4,\"Al menos una vez en el ultimo año\",IF(H9=3,\"Al menos una vez en los ultimos 2 años\",IF(H9=2,\"Al menos una vez en los ultimos 5 años\",\"No se ha presentado en los ultimos 5 años\"))))","v":"Mas de una vez al año"},{"$f":"CONCATENATE(H$9,K$9)","v":"54"},4,{"$f":"IF(K9=5,\"Catastrófico\",IF(K9=4,\"Mayor\",IF(K9=3,\"Moderado\",IF(K9=2,\"Menos\",IF(K9=1,\"Insignificante\",\"Digite Valor entre 1 y 5\")))))","v":"Mayor"},{"$f":"IF(L9=\"Digite Valor entre 1 y 5\",\"\",IF(COUNTIF(CE$10:CE$17,CONCATENATE(H9,K9)),CE$9,IF(COUNTIF(CF$10:CF$17,CONCATENATE(H9,K9)),CF$9,IF(COUNTIF(CG$10:CG$13,CONCATENATE(H9,K9)),CG$9,CH$9))))","v":"Zona de Riesgo Extrema"},{"$f":"IF(M9=CE$9,\"E\",IF(M9=CF$9,\"A\",IF(M9=CG$9,\"M\",IF(M9=CH$9,\"B\",\"\"))))","v":"E"},"Control Preventivo","presentación de la necesidad en el plan de compras","Anual","Afecta la Probabilidad","Si",{"$f":"IF(S9=\"Si\",15,0)","v":15},"Si",{"$f":"IF(U9=\"Si\",5,0)","v":5},"No",{"$f":"IF(W9=\"Si\",15,0)","v":0},"Si",{"$f":"IF(Y9=\"Si\",10,0)","v":10},"Si",{"$f":"IF(AA9=\"Si\",15,0)","v":15},"Si",{"$f":"IF(AC9=\"Si\",10,0)","v":10},"Si",{"$f":"IF(AE9=\"Si\",30,0)","v":30},{"$f":"T9+V9+X9+Z9+AB9+AD9+AF9","v":85},{"$f":"IF(R9=\"\",\"\",IF(R9=\"Afecta la Probabilidad\",IF(AND(AG9>=0,AG9<=50),\"No disminuye la Probabilidad\",IF(AND(AG9>50,AG9<=75),\"Disminuye la Probabilidad en 1\",IF(AND(AG9>75,AG9<=100),\"Disminuye la Probabilidad en 2\",\"\"))),IF(AND(AG9>=0,AG9<=50),\"No disminuye el Impacto\",IF(AND(AG9>50,AG9<=75),\"Disminuye el Impacto en 1\",IF(AND(AG9>75,AG9<=100),\"Disminuye el Impacto en 2\",\"\")))))","v":"Disminuye la Probabilidad en 2"},{"$f":"IF(AG9<=50,0,IF(AND(AG9>50,AG9<=75),1,IF(AND(AG9>75,AG9<=100),2,\"\")))","v":2},{"$f":"BD9","v":3},{"$f":"IF(AJ9=5,\"Mas de una vez al año\",IF(AJ9=4,\"Al menos una vez en el ultimo año\",IF(AJ9=3,\"Al menos una vez en los ultimos 2 años\",IF(AJ9=2,\"Al menos una vez en los ultimos 5 años\",\"No se ha presentado en los ultimos 5 años\"))))","v":"Al menos una vez en los ultimos 2 años"},{"$f":"BF9","v":3},{"$f":"IF(AL9=5,\"Catastrófico - Tendría desastrosas consecuencias o efectos sobre la institución\",IF(AL9=4,\"Mayor - Tendría altas consecuencias o efectos sobre la institución\",IF(AL9=3,\"Moderado - Tendría medianas consecuencias o efectos sobre la institución\",IF(AL9=2,\"Menos - Tendría bajo impacto o efecto sobre la institución\",IF(AL9=1,\"Insignificante - tendría consecuencias o efectos mínimos en la institución\",\"Digite Valor entre 1 y 5\")))))","v":"Moderado - Tendría medianas consecuencias o efectos sobre la institución"},{"$f":"CONCATENATE(AJ9,AL9)","v":"33"},{"$f":"IF(COUNTIF($CE$10:$CE$17,AN9),$CE$9,IF(COUNTIF($CF$10:$CF$17,AN9),$CF$9,IF(COUNTIF($CG$10:$CG$13,AN9),$CG$9,IF(COUNTIF($CH$10:$CH$14,AN9),$CH$9,\"\"))))","v":"Zona de Riesgo Alta"},{"$f":"IF(AO9=CE9,\"E\",IF(AO9=CF9,\"A\",IF(AO9=CG9,\"M\",IF(AO9=CH9,\"B\",\"\"))))","v":"A"},null,"Planificar los requerimientos de ancho de banda para prestacion del servicio de internet.         \n\nSolicitar el CDP para contratar el servicio del ISP.","Oficina de Planeación y Desarrollo Institucional\nVicerrectoría Administrativa","2015-01-01","2015-12-31","Acta y solicitud formal del CDP, CDP, RDP",{"$f":"H9","v":5},{"$f":"IF(R9=\"Afecta la Probabilidad\",AW9-(AW9-AI9),\"No aplica\")","v":2},{"$f":"K9","v":4},{"$f":"IF(R9=\"Afecta el Impacto\",AY9-(AY9-AI9),\"No aplica\")","v":"No aplica"},{"$f":"IF(Matriz!R9=\"Afecta el Impacto\",CONCATENATE(AW9,AZ9),CONCATENATE(AX9,AY9))","v":"24"},{"$f":"IF(R9=\"\",\"\",SUMIF(R9:R17,\"Afecta la Probabilidad\",AX9:AX17))","v":2},{"$f":"IF(R9=\"\",\"\",SUMIF(R9:R17,\"Afecta el Impacto\",AZ9:AZ17))","v":1},{"$f":"IF(BB9=\"\",\"\",IF(H9-BB9<=0,1,H9-BB9))","v":3},{"$f":"CONCATENATE(BD9,BF9)","v":"33"},{"$f":"IF(K9=\"\",\"\",IF(K9-BC9<0,1,K9-BC9))","v":3},null,"Factor",null,"Factor Interno","Factor Externo","Diseño del proceso",{"$nulls":6},"Contexto",{"$nulls":3},"Tabla de Probabilidad",{"$nulls":4},"Impacto",null,null,"Zona de Riesgo Extrema","Zona de Riesgo Alta","Zona de Riesgo Moderada","Zona de Riesgo Baja",null,"FRECUENCIA DEL CONTROL",{"$nulls":5},"RANGOS DE CALIFICACIÓN DE LOS CONTROLES ","DEPENDIENDO SI EL CONTROL AFECTA PROBABILIDAD O IMPACTO DESPLAZA EN LA MATRIZ DE EVALUACIÓN DEL RIESGO ASÍ: ",null,null,"TIPO DE CONTROL",null,"Controles de Gestión","Controles Operativos","Controles Legales",null,null,"TIPO DE CONTROL","DESCRIPCIÓN TIPO DE CONTROL"]
[null,{"$f":"B9+1","v":2},"Factor_Externo","Comunicación externa","Ausencia de proveedores en el Proceso de licitacion",null,"Pérdida de acceso al correo Institucional",{"$nulls":7},"Control Correctivo","Aplicación de cláusulas de cumplimiento de contrato con ISP","A Solicitud","Afecta el Impacto","Si",15,"Si",5,"No",0,"Si",10,"No",0,"Si",10,"No",{"$f":"IF(AE10=\"Si\",30,0)","v":0},{"$f":"T10+V10+X10+Z10+AB10+AD10+AF10","v":40},{"$f":"IF(R10=\"\",\"\",IF(R10=\"Afecta la Probabilidad\",IF(AND(AG10>=0,AG10<=50),\"No disminuye la Probabilidad\",IF(AND(AG10>50,AG10<=75),\"Disminuye la Probabilidad en 1\",IF(AND(AG10>75,AG10<=100),\"Disminuye la Probabilidad en 2\",\"\"))),IF(AND(AG10>=0,AG10<=50),\"No disminuye el Impacto\",IF(AND(AG10>50,AG10<=75),\"Disminuye el Impacto en 1\",IF(AND(AG10>75,AG10<=100),\"Disminuye el Impacto en 2\",\"\")))))","v":"No disminuye el Impacto"},{"$f":"IF(AG10<=50,0,IF(AND(AG10>50,AG10<=75),1,IF(AND(AG10>75,AG10<=100),2,\"\")))","v":0},{"$nulls":7},"El reporte de fallas incluye pruebas de conectividad realizadas, e informacion de las herramientas de monitoreo. ","Generar reporte de falla del servicio de internet, comunicación con ISP y aplicación de clausulas  de cumplimiento del contrato.   ","Supervisor del contrato , area SSI","2015-01-01","2015-12-31","Contrato con ISP, Reporte de fallas del servicio ",null,{"$f":"IF(R10=\"Afecta la Probabilidad\",AW10-(AW10-AI10),\"No aplica\")","v":"No aplica"},null,0,{"$f":"IF(Matriz!R10=\"Afecta el Impacto\",CONCATENATE(AW10,AZ10),CONCATENATE(AX10,AY10))","v":"0"},{"$nulls":6},"Factor_Interno",null,"Infraestructura","Económicos","Interacciones con otros procesos",{"$nulls":6},"Externo","Interno","Del Proceso",null,"Nivel","Descriptor","Descripción","Frecuencia",null,"Catastrófico",5,null,25,14,13,11,null,"Mensual",null,"Afecta el Impacto",null,"Si",null,null,"En Probabilidad Avanza hacia abajo En Impacto Avanza hacia la izquierda CUADRANTES A DISMINUIR",null,null,"Controles_de_Gestion",null,"Politicas Claras Aplicadas","Conciliaciones","Normas Claras y Aplicadas",null,null,"Control Preventivo"]
[null,3,"Factor_Externo","Tecnológicos","Fallas del proveedor de servicio ISP",null,"Interrupción de servicios bancarios",{"$nulls":7},"Control Correctivo","cambio a proveedor secundario","A Solicitud","Afecta el Impacto","Si",15,"Si",5,"No",0,"Si",10,"Si",15,"Si",10,"No",0,55,{"$f":"IF(R11=\"\",\"\",IF(R11=\"Afecta la Probabilidad\",IF(AND(AG11>=0,AG11<=50),\"No disminuye la Probabilidad\",IF(AND(AG11>50,AG11<=75),\"Disminuye la Probabilidad en 1\",IF(AND(AG11>75,AG11<=100),\"Disminuye la Probabilidad en 2\",\"\"))),IF(AND(AG11>=0,AG11<=50),\"No disminuye el Impacto\",IF(AND(AG11>50,AG11<=75),\"Disminuye el Impacto en 1\",IF(AND(AG11>75,AG11<=100),\"Disminuye el Impacto en 2\",\"\")))))","v":"Disminuye el Impacto en 1"},1,{"$nulls":8},"Cambio de rutas de salida a internet de los servicios institucionales al proveedor secundario , verificacion del servicio. ","Coordinador Area de servidores y servicios de internet","2015-01-01","2015-12-31","Reporte de fallas del servicio, logs de sistemas. ",null,{"$f":"IF(R11=\"Afecta la Probabilidad\",AW11-(AW11-AI11),\"No aplica\")","v":"No aplica"},null,1,{"$f":"IF(Matriz!R11=\"Afecta el Impacto\",CONCATENATE(AW11,AZ11),CONCATENATE(AX11,AY11))","v":"1"},{"$nulls":6},"Factor_Externo",null,"Personal","Medioambientales","Transversalidad",{"$nulls":6},"Económicos","Financieros","Diseño del proceso",null,5,"Casi seguro","Se espera que el evento ocurra en la mayoria de las veces","Más de 1 vez al año.",null,"Mayor ",4,null,35,15,23,12,null,"Bimensual",null,"Afecta la Probabilidad",null,"No",null,"Entre 0-50",0,null,null,"Controles_Operativos",null,"Seguimiento al plan Estrategico y Operativo","Consecutivos","Control de Terminos",null,null,"Control Correctivo"]
[null,4,"Factor_Interno","Personal","Errores de Configuración",null,"servicios Insititucionales inaccesibles desde internet, como SIMCA, inscripciones etc.",{"$nulls":12},0,null,0,null,0,null,0,null,0,null,0,null,0,0,{"$f":"IF(R12=\"\",\"\",IF(R12=\"Afecta la Probabilidad\",IF(AND(AG12>=0,AG12<=50),\"No disminuye la Probabilidad\",IF(AND(AG12>50,AG12<=75),\"Disminuye la Probabilidad en 1\",IF(AND(AG12>75,AG12<=100),\"Disminuye la Probabilidad en 2\",\"\"))),IF(AND(AG12>=0,AG12<=50),\"No disminuye el Impacto\",IF(AND(AG12>50,AG12<=75),\"Disminuye el Impacto en 1\",IF(AND(AG12>75,AG12<=100),\"Disminuye el Impacto en 2\",\"\")))))","v":""},0,{"$nulls":14},"No aplica",null,"No aplica",{"$f":"IF(Matriz!R12=\"Afecta el Impacto\",CONCATENATE(AW12,AZ12),CONCATENATE(AX12,AY12))","v":"No aplica"},{"$nulls":6},"Factor_del_Proceso",null,"Procesos ","Políticos","Procedimientos asociados",{"$nulls":6},"Politicos","Personal","Interacciones con otros procesos",null,4,"Probable","Es varaible que el evento ocurra en la mayoria de las circunstancias","Al menos de 1 vez en el último año",null,"Moderado",3,null,45,24,32,21,null,"Trimestral",{"$nulls":5},"Entre 51-75",1,null,null,"Controles_Legales",null,"Indicadors de Gestión","VerificacIón de Firmas",{"$nulls":3},"Control Detectivo"]
[null,5,"Factor_del_Proceso","Procedimientos asociados","Fallas en el suminstro eléctrico",null,"afectación de la imagen Insitucional",{"$nulls":12},0,null,0,null,0,null,0,null,0,null,0,null,0,0,"",0,{"$nulls":14},"No aplica",null,"No aplica",{"$f":"IF(Matriz!R13=\"Afecta el Impacto\",CONCATENATE(AW13,AZ13),CONCATENATE(AX13,AY13))","v":"No aplica"},{"$nulls":8},"Tecnología","Sociales","Responsables de proceso",{"$nulls":6},"Sociales","Procesos","Transversalidad",null,3,"Posible","El evento podrá ocurrir en algun momento","Al menos de 1 vez en los últimos 2 años",null,"Menos ",2,null,55,33,41,22,null,"Semestral",{"$nulls":5},"Entre 76-100",2,{"$nulls":4},"Seguimiento al cronograma","Lista de Chequeo"]
[null,6,{"$nulls":4},"base de datos de afiliados a unidad de salud no accesible",{"$nulls":12},0,null,0,null,0,null,0,null,0,null,0,null,0,0,"",0,{"$nulls":14},"No aplica",null,"No aplica",{"$nulls":10},"Tecnológicos","Comunicación entre procesos",{"$nulls":6},"Tecnológicos","Tecnología","Procedimientos asociados",null,2,"Improbable","El evento puede ocurrir en algun momento","Al menos de 1 vez en los últimos 5 años",null,"Insignificante",1,null,34,42,null,31,null,"Anual",{"$nulls":11},"Informes de Gestión","Registro Controlado"]
[null,7,{"$nulls":17},0,null,0,null,0,null,0,null,0,null,0,null,0,0,"",0,{"$nulls":14},"No aplica",null,"No aplica",{"$nulls":18},"Medioambientales","Estratégicos","Responsables de proceso",null,1,"Rara Vez","El evento puede ocurrir solo en circunstancias excepcionales\n ( poco comunes o anormales)","No se ha presentado en los últimos 5 años",{"$nulls":4},44,43,{"$nulls":3},"A Solicitud",{"$nulls":12},"Segregación de Funciones"]
[null,8,{"$nulls":17},0,null,0,null,0,null,0,null,0,null,0,null,0,0,"",0,{"$nulls":14},"No aplica",null,"No aplica",{"$nulls":18},"Comunicación externa","Comunicación interna","Comunicación entre procesos",{"$nulls":9},54,51,{"$nulls":3},"Continuo",{"$nulls":12},"Niveles de Autorización"]
[null,9,{"$nulls":17},0,null,0,null,0,null,0,null,0,null,0,null,0,0,"",0,{"$nulls":14},"No aplica",null,"No aplica",{"$f":"IF(Matriz!R17=\"Afecta el Impacto\",CONCATENATE(AW17,AZ17),CONCATENATE(AX17,AY17))","v":"No aplica"},{"$nulls":29},53,52,{"$nulls":16},"Custodia Apropiada"]
["R2",1,"Factor_Externo","Económicos","Inexistencia de un sistema especializado de copias de respaldo","Incapacidad de recuperar información a partir de copias de respaldo. ","Pérdida de la información critica ",4,{"$f":"IF(H18=5,\"Mas de una vez al año\",IF(H18=4,\"Al menos una vez en el ultimo año\",IF(H18=3,\"Al menos una vez en los ultimos 2 años\",IF(H18=2,\"Al menos una vez en los ultimos 5 años\",\"No se ha presentado en los ultimos 5 años\"))))","v":"Al menos una vez en el ultimo año"},{"$f":"CONCATENATE(H$18,K$18)","v":"45"},5,{"$f":"IF(K18=5,\"Catastrófico\",IF(K18=4,\"Mayor\",IF(K18=3,\"Moderado\",IF(K18=2,\"Menos\",IF(K18=1,\"Insignificante\",\"Digite Valor entre 1 y 5\")))))","v":"Catastrófico"},{"$f":"IF(L18=\"Digite Valor entre 1 y 5\",\"\",IF(COUNTIF(CE$10:CE$17,CONCATENATE(H18,K18)),CE$9,IF(COUNTIF(CF$10:CF$17,CONCATENATE(H18,K18)),CF$9,IF(COUNTIF(CG$10:CG$13,CONCATENATE(H18,K18)),CG$9,CH$9))))","v":"Zona de Riesgo Extrema"},{"$f":"IF(M18=CE$9,\"E\",IF(M18=CF$9,\"A\",IF(M18=CG$9,\"M\",IF(M18=CH$9,\"B\",\"\"))))","v":"E"},"Control Preventivo","Ejecución de script para la obtención de copias de respaldo ","Continuo","Afecta la Probabilidad","Si",15,"Si",5,"Si",15,"Si",10,"No",0,"Si",10,"No",0,{"$f":"T18+V18+X18+Z18+AB18+AD18+AF18","v":55},{"$f":"IF(R18=\"\",\"\",IF(R18=\"Afecta la Probabilidad\",IF(AND(AG18>=0,AG18<=50),\"No disminuye la Probabilidad\",IF(AND(AG18>50,AG18<=75),\"Disminuye la Probabilidad en 1\",IF(AND(AG18>75,AG18<=100),\"Disminuye la Probabilidad en 2\",\"\"))),IF(AND(AG18>=0,AG18<=50),\"No disminuye el Impacto\",IF(AND(AG18>50,AG18<=75),\"Disminuye el Impacto en 1\",IF(AND(AG18>75,AG18<=100),\"Disminuye el Impacto en 2\",\"\")))))","v":"Disminuye la Probabilidad en 1"},1,{"$f":"BD18","v":3},{"$f":"IF(AJ18=5,\"Mas de una vez al año\",IF(AJ18=4,\"Al menos una vez en el ultimo año\",IF(AJ18=3,\"Al menos una vez en los ultimos 2 años\",IF(AJ18=2,\"Al menos una vez en los ultimos 5 años\",\"No se ha presentado en los ultimos 5 años\"))))","v":"Al menos una vez en los ultimos 2 años"},{"$f":"BF18","v":4},{"$f":"IF(AL18=5,\"Catastrófico - Tendría desastrosas consecuencias o efectos sobre la institución\",IF(AL18=4,\"Mayor - Tendría altas consecuencias o efectos sobre la institución\",IF(AL18=3,\"Moderado - Tendría medianas consecuencias o efectos sobre la institución\",IF(AL18=2,\"Menos - Tendría bajo impacto o efecto sobre la institución\",IF(AL18=1,\"Insignificante - tendría consecuencias o efectos mínimos en la institución\",\"Digite Valor entre 1 y 5\")))))","v":"Mayor - Tendría altas consecuencias o efectos sobre la institución"},{"$f":"CONCATENATE(AJ18,AL18)","v":"34"},{"$f":"IF(COUNTIF($CE$10:$CE$17,AN18),$CE$9,IF(COUNTIF($CF$10:$CF$17,AN18),$CF$9,IF(COUNTIF($CG$10:$CG$13,AN18),$CG$9,IF(COUNTIF($CH$10:$CH$14,AN18),$CH$9,\"\"))))","v":"Zona de Riesgo Extrema"},{"$f":"IF(AO18=CE9,\"E\",IF(AO18=CF9,\"A\",IF(AO18=CG9,\"M\",IF(AO18=CH9,\"B\",\"\"))))","v":"E"},"Actualmete se tiene implementado un sistema de copias de respaldo  adaptado, basado en equipos tecnologicamente obsoletos.   ","Adquirir un solución  tecnológica moderna para la realización de copias de respaldo de los sistemas criticos.","Vicerrectoría Administrativa, Jefatura de las TIC.","2016-01-01","2016-12-31","Logs, reportes de eventos, Instructivos, registros en herramientas de monitoreo, copias de respaldo.",{"$f":"H18","v":4},{"$f":"IF(R18=\"Afecta la Probabilidad\",AW18-(AW18-AI18),\"No aplica\")","v":1},{"$f":"K18","v":5},"No aplica",{"$f":"IF([1]Matriz!R18=\"Afecta el Impacto\",CONCATENATE(AW18,AZ18),CONCATENATE(AX18,AY18))","v":"15"},{"$f":"IF(R18=\"\",\"\",SUMIF(R18:R26,\"Afecta la Probabilidad\",AX18:AX26))","v":1},{"$f":"IF(R18=\"\",\"\",SUMIF(R18:R26,\"Afecta el Impacto\",AZ18:AZ26))","v":1},{"$f":"IF(BB18=\"\",\"\",IF(H18-BB18<=0,1,H18-BB18))","v":3},{"$f":"CONCATENATE(BD18,BF18)","v":"34"},{"$f":"IF(K18=\"\",\"\",IF(K18-BC18<0,1,K18-BC18))","v":4},{"$nulls":42},"Procedimientos Formales aplicados"]
[null,{"$f":"B18+1","v":2},"Factor_Interno","Personal","Manejo inadecuado de los medios de almacenamiento",null,"Imposibilidad del restablecimiento de los servicios ",{"$nulls":7},"Control Preventivo","Grabación, rotación y almacenamiento de cintas.","Anual","Afecta la Probabilidad","No",0,"Si",5,"No",0,"Si",10,"No",0,"No",0,"No",0,{"$f":"T19+V19+X19+Z19+AB19+AD19+AF19","v":15},"No disminuye la Probabilidad",0,{"$nulls":14},{"$f":"IF(R19=\"Afecta la Probabilidad\",AW19-(AW19-AI19),\"No aplica\")","v":0},null,"No aplica",{"$f":"IF([1]Matriz!R19=\"Afecta el Impacto\",CONCATENATE(AW19,AZ19),CONCATENATE(AX19,AY19))","v":"No aplica"},{"$nulls":47},"Pólizas"]
[null,{"$f":"B19+1","v":3},"Factor_Interno","Tecnología","Interrupción del procedimiento de copia",null,"afectación en la generación de reportes  de bases de datos  ",{"$nulls":7},"Control Correctivo","Reporte automatico de fallo en el proceso de copia de respaldo.","A Solicitud","Afecta el Impacto","Si",15,"Si",5,"Si",15,"No",0,"Si",15,"Si",10,"No",0,60,"Disminuye el Impacto en 1",1,{"$nulls":14},"No aplica",null,1,{"$f":"IF([1]Matriz!R20=\"Afecta el Impacto\",CONCATENATE(AW20,AZ20),CONCATENATE(AX20,AY20))","v":"No aplica"},{"$nulls":47},"Seguridad Física"]
[null,4,"Factor_Interno","Personal","Falta de verificación en el proceso de copia de respaldo",{"$nulls":9},"Control Preventivo","verificacion de copia de respaldo ","Mensual","Afecta la Probabilidad","Si",15,"Si",5,"No",0,"Si",10,"No",0,"No",0,"No",0,30,"No disminuye la Probabilidad",0,{"$nulls":14},0,null,"No aplica",{"$f":"IF([1]Matriz!R21=\"Afecta el Impacto\",CONCATENATE(AW21,AZ21),CONCATENATE(AX21,AY21))","v":"0"},{"$nulls":47},"Contingencias y Respaldo"]
[null,5,{"$nulls":17},0,null,0,null,0,null,0,null,0,null,0,null,0,0,"",0,{"$nulls":14},"No aplica",null,"No aplica",{"$f":"IF([1]Matriz!R22=\"Afecta el Impacto\",CONCATENATE(AW22,AZ22),CONCATENATE(AX22,AY22))","v":"No aplica"},{"$nulls":47},"Personal Capacitado"]
[null,6,{"$nulls":17},0,null,0,null,0,null,0,null,0,null,0,null,0,0,"",0,{"$nulls":14},"No aplica",null,"No aplica",{"$f":"IF([1]Matriz!R23=\"Afecta el Impacto\",CONCATENATE(AW23,AZ23),CONCATENATE(AX23,AY23))","v":"No aplica"},{"$nulls":47},"Aseguramiento y Calidad"]
[null,7,{"$nulls":17},0,null,0,null,0,null,0,null,0,null,0,null,0,0,{"$f":"IF(R24=\"\",\"\",IF(R24=\"Afecta la Probabilidad\",IF(AND(AG24>=0,AG24<=50),\"No disminuye la Probabilidad\",IF(AND(AG24>50,AG24<=75),\"Disminuye la Probabilidad en 1\",IF(AND(AG24>75,AG24<=100),\"Disminuye la Probabilidad en 2\",\"\"))),IF(AND(AG24>=0,AG24<=50),\"No disminuye el Impacto\",IF(AND(AG24>50,AG24<=75),\"Disminuye el Impacto en 1\",IF(AND(AG24>75,AG24<=100),\"Disminuye el Impacto en 2\",\"\")))))","v":""},0,{"$nulls":14},"No aplica",null,"No aplica",{"$f":"IF([1]Matriz!R24=\"Afecta el Impacto\",CONCATENATE(AW24,AZ24),CONCATENATE(AX24,AY24))","v":"No aplica"}]
[null,8,{"$nulls":17},0,null,0,null,0,null,0,null,0,null,0,null,0,0,"",0,{"$nulls":14},"No aplica",null,"No aplica",{"$f":"IF([1]Matriz!R25=\"Afecta el Impacto\",CONCATENATE(AW25,AZ25),CONCATENATE(AX25,AY25))","v":"No aplica"}]
[null,9,{"$nulls":17},0,null,0,null,0,null,0,null,0,null,0,null,0,0,"",0,{"$nulls":14},"No aplica",null,"No aplica",{"$f":"IF([1]Matriz!R26=\"Afecta el Impacto\",CONCATENATE(AW26,AZ26),CONCATENATE(AX26,AY26))","v":"No aplica"}]
["R3",1,"Factor_del_Proceso","Procedimientos asociados","Acceso no autorizado al centro de datos ","Fallas en recursos tecnológicos del centro de datos ","Hurto de recursos tecnologicos e informacion",5,{"$f":"IF(H27=5,\"Mas de una vez al año\",IF(H27=4,\"Al menos una vez en el ultimo año\",IF(H27=3,\"Al menos una vez en los ultimos 2 años\",IF(H27=2,\"Al menos una vez en los ultimos 5 años\",\"No se ha presentado en los ultimos 5 años\"))))","v":"Mas de una vez al año"},{"$f":"CONCATENATE(H$27,K$27)","v":"55"},5,{"$f":"IF(K27=5,\"Catastrófico\",IF(K27=4,\"Mayor\",IF(K27=3,\"Moderado\",IF(K27=2,\"Menos\",IF(K27=1,\"Insignificante\",\"Digite Valor entre 1 y 5\")))))","v":"Catastrófico"},{"$f":"IF(L27=\"Digite Valor entre 1 y 5\",\"\",IF(COUNTIF(CE$10:CE$17,CONCATENATE(H27,K27)),CE$9,IF(COUNTIF(CF$10:CF$17,CONCATENATE(H27,K27)),CF$9,IF(COUNTIF(CG$10:CG$13,CONCATENATE(H27,K27)),CG$9,CH$9))))","v":"Zona de Riesgo Extrema"},{"$f":"IF(M27=CE$9,\"E\",IF(M27=CF$9,\"A\",IF(M27=CG$9,\"M\",IF(M27=CH$9,\"B\",\"\"))))","v":"E"},"Control Preventivo","sistemas de autentificacion biometricos y registro de ingreso y salida de personal autorizado","Continuo","Afecta la Probabilidad","No",0,"Si",5,"Si",15,"No",0,"Si",15,"Si",10,"Si",30,75,"Disminuye la Probabilidad en 1",1,{"$f":"BD27","v":1},{"$f":"IF(AJ27=5,\"Mas de una vez al año\",IF(AJ27=4,\"Al menos una vez en el ultimo año\",IF(AJ27=3,\"Al menos una vez en los ultimos 2 años\",IF(AJ27=2,\"Al menos una vez en los ultimos 5 años\",\"No se ha presentado en los ultimos 5 años\"))))","v":"No se ha presentado en los ultimos 5 años"},{"$f":"BF27","v":4},{"$f":"IF(AL27=5,\"Catastrófico - Tendría desastrosas consecuencias o efectos sobre la institución\",IF(AL27=4,\"Mayor - Tendría altas consecuencias o efectos sobre la institución\",IF(AL27=3,\"Moderado - Tendría medianas consecuencias o efectos sobre la institución\",IF(AL27=2,\"Menos - Tendría bajo impacto o efecto sobre la institución\",IF(AL27=1,\"Insignificante - tendría consecuencias o efectos mínimos en la institución\",\"Digite Valor entre 1 y 5\")))))","v":"Mayor - Tendría altas consecuencias o efectos sobre la institución"},{"$f":"CONCATENATE(AJ27,AL27)","v":"14"},{"$f":"IF(COUNTIF($CE$10:$CE$17,AN27),$CE$9,IF(COUNTIF($CF$10:$CF$17,AN27),$CF$9,IF(COUNTIF($CG$10:$CG$13,AN27),$CG$9,IF(COUNTIF($CH$10:$CH$14,AN27),$CH$9,\"\"))))","v":"Zona de Riesgo Alta"},{"$f":"IF(AO27=$CE$9,\"E\",IF(AO27=$CF$9,\"A\",IF(AO27=$CG$9,\"M\",IF(AO27=$CH$9,\"B\",\"\"))))","v":"A"},"Se cuenta con un sistema biometrico en la entrada y salida de cada centro de datos  , ademas de llevar un reporte manualmente , donde cada persona registra su  entrada y salida.","Registrar usuarios con acceso al centro de datos, mediante bitacora.  ","Area de Monitoreo y Servidores y servicios de internet","2015-01-01","2015-12-31","registros de personal autorizado, bitacora y sistema biometrico",5,1,5,"No aplica",{"$f":"IF([1]Matriz!R27=\"Afecta el Impacto\",CONCATENATE(AW27,AZ27),CONCATENATE(AX27,AY27))","v":"15"},{"$f":"IF(R27=\"\",\"\",SUMIF(R27:R35,\"Afecta la Probabilidad\",AX27:AX35))","v":5},{"$f":"IF(R27=\"\",\"\",SUMIF(R27:R35,\"Afecta el Impacto\",AZ27:AZ35))","v":1},{"$f":"IF(BB27=\"\",\"\",IF(H27-BB27<=0,1,H27-BB27))","v":1},{"$f":"CONCATENATE(BD27,BF27)","v":"14"},{"$f":"IF(K27=\"\",\"\",IF(K27-BC27<0,1,K27-BC27))","v":4}]
[null,{"$f":"B27+1","v":2},"Factor_Interno","Personal","Manipulación incorrecta de los recursos tecnológicos de red ",null,"Alteración o interrupcion en la prestacion de los servicios Institucionales.",{"$nulls":7},"Control Preventivo","mantenimiento preventivo  y correctivo de UPS, planta y sistema electrico y aire acondicionado del centro de datos ","Trimestral","Afecta la Probabilidad","Si",15,"Si",5,"No",0,"Si",10,"No",0,"Si",10,"No",0,40,{"$f":"IF(R28=\"\",\"\",IF(R28=\"Afecta la Probabilidad\",IF(AND(AG28>=0,AG28<=50),\"No disminuye la Probabilidad\",IF(AND(AG28>50,AG28<=75),\"Disminuye la Probabilidad en 1\",IF(AND(AG28>75,AG28<=100),\"Disminuye la Probabilidad en 2\",\"\"))),IF(AND(AG28>=0,AG28<=50),\"No disminuye el Impacto\",IF(AND(AG28>50,AG28<=75),\"Disminuye el Impacto en 1\",IF(AND(AG28>75,AG28<=100),\"Disminuye el Impacto en 2\",\"\")))))","v":"No disminuye la Probabilidad"},0,{"$nulls":7},"el mantenimiento preventivo es programado por el area de equipos , para el caso de fallos en el  sistema, la solicitud es enviada por el area de servidores y esta es atentida por el area de equipos. ","Realizar el mantenimiento preventivo, para el caso de fallos, solicitar el mantenimiento del equipo  afectado, verificar que nuevamente este en funcionamiento.","Area de equipos","2015-01-01","2015-12-31","correo electronico con solicitud y respuesta de que el mantenimiento fue realizado , Reporte de fallas ",null,0,null,"No aplica",{"$f":"IF([1]Matriz!R28=\"Afecta el Impacto\",CONCATENATE(AW28,AZ28),CONCATENATE(AX28,AY28))","v":"No aplica"}]
[null,{"$f":"B28+1","v":3},"Factor_Interno","Financieros","Instalaciones físicas no adeacuadas ",null,"Pérdida de Infomación",{"$nulls":7},"Control Correctivo","reportes de fallos en UPS , sistema electrico  o  aire acondicionado ","A Solicitud","Afecta el Impacto","No",0,"Si",5,"No",0,"Si",10,"Si",15,"Si",10,"Si",30,70,{"$f":"IF(R29=\"\",\"\",IF(R29=\"Afecta la Probabilidad\",IF(AND(AG29>=0,AG29<=50),\"No disminuye la Probabilidad\",IF(AND(AG29>50,AG29<=75),\"Disminuye la Probabilidad en 1\",IF(AND(AG29>75,AG29<=100),\"Disminuye la Probabilidad en 2\",\"\"))),IF(AND(AG29>=0,AG29<=50),\"No disminuye el Impacto\",IF(AND(AG29>50,AG29<=75),\"Disminuye el Impacto en 1\",IF(AND(AG29>75,AG29<=100),\"Disminuye el Impacto en 2\",\"\")))))","v":"Disminuye el Impacto en 1"},1,{"$nulls":8},"Generar documentación donde se informe en detalle del incidente ocurrido (duración, ubicación, usuarios comprometidos, alcance del incidente ) ","Area de Servidores y servicios de internet, Area de equipos","2015-01-01","2015-12-31","Documento de reporte de fallos ",null,"No aplica",null,1,{"$f":"IF([1]Matriz!R29=\"Afecta el Impacto\",CONCATENATE(AW29,AZ29),CONCATENATE(AX29,AY29))","v":"No aplica"}]
[null,4,"Factor_Externo","Tecnológicos","Fallas en el suministro electrico ",{"$nulls":9},"Control Preventivo","mantenimiento preventivo de  recursos tecnologicos","Semestral","Afecta la Probabilidad","Si",15,"Si",5,"No",0,"Si",10,"Si",15,"Si",10,"Si",30,85,{"$f":"IF(R30=\"\",\"\",IF(R30=\"Afecta la Probabilidad\",IF(AND(AG30>=0,AG30<=50),\"No disminuye la Probabilidad\",IF(AND(AG30>50,AG30<=75),\"Disminuye la Probabilidad en 1\",IF(AND(AG30>75,AG30<=100),\"Disminuye la Probabilidad en 2\",\"\"))),IF(AND(AG30>=0,AG30<=50),\"No disminuye el Impacto\",IF(AND(AG30>50,AG30<=75),\"Disminuye el Impacto en 1\",IF(AND(AG30>75,AG30<=100),\"Disminuye el Impacto en 2\",\"\")))))","v":"Disminuye la Probabilidad en 2"},2,{"$nulls":7},"Se cuenta con diferentes herramientas de monitoreo como Nagios, Forti Analyzer entre otros","Revisón constante del estado de los servicios , logs y estadísticas, atencion prioritaria para alarmas y servicios en estado crítico","Area de Servidores y servicios de internet, Area de infraestructura","2015-01-01","2015-12-31","Notificaciones, Logs, estadisticas porporcionadas por las herramientas de gestion",null,2,null,"No aplica",{"$f":"IF([1]Matriz!R30=\"Afecta el Impacto\",CONCATENATE(AW30,AZ30),CONCATENATE(AX30,AY30))","v":"2"}]
[null,5,"Factor_Interno","Tecnología","Fallas en sistema de aire acondicionado ",{"$nulls":9},"Control Preventivo","Turnos de disponibilidad personal para el monitoreo de los recursos","Continuo","Afecta la Probabilidad","Si",{"$f":"IF(S31=\"Si\",15,0)","v":15},"Si",5,"No",0,"Si",10,"Si",15,"Si",10,"Si",30,85,{"$f":"IF(R31=\"\",\"\",IF(R31=\"Afecta la Probabilidad\",IF(AND(AG31>=0,AG31<=50),\"No disminuye la Probabilidad\",IF(AND(AG31>50,AG31<=75),\"Disminuye la Probabilidad en 1\",IF(AND(AG31>75,AG31<=100),\"Disminuye la Probabilidad en 2\",\"\"))),IF(AND(AG31>=0,AG31<=50),\"No disminuye el Impacto\",IF(AND(AG31>50,AG31<=75),\"Disminuye el Impacto en 1\",IF(AND(AG31>75,AG31<=100),\"Disminuye el Impacto en 2\",\"\")))))","v":"Disminuye la Probabilidad en 2"},2,{"$nulls":7},"semanalmente se asigna un ingeniero para monitorear los recursos del centro de datos","Asignación de turnos de disponibilidad.","Area de Servidores y servicios de internet","2015-01-01","2015-12-31","calendario de disponibilidad, reportes de disponibilidad ",null,2,null,"No aplica",{"$f":"IF([1]Matriz!#REF!=\"Afecta el Impacto\",CONCATENATE(AW31,AZ31),CONCATENATE(AX31,AY31))","v":{"$error":"#REF!"}}]
[null,6,"Factor_Externo","Medioambientales","Terremotos, inundaciones, incendios, tormentas.",{"$nulls":9},"Control Correctivo","apagado y encendido controlado de recursos tecnologicos","A Solicitud","Afecta el Impacto","Si",{"$f":"IF(S32=\"Si\",15,0)","v":15},"Si",5,"No",0,"Si",10,"Si",15,"Si",10,"Si",30,85,{"$f":"IF(R31=\"\",\"\",IF(R31=\"Afecta la Probabilidad\",IF(AND(AG32>=0,AG32<=50),\"No disminuye la Probabilidad\",IF(AND(AG32>50,AG32<=75),\"Disminuye la Probabilidad en 1\",IF(AND(AG32>75,AG32<=100),\"Disminuye la Probabilidad en 2\",\"\"))),IF(AND(AG32>=0,AG32<=50),\"No disminuye el Impacto\",IF(AND(AG32>50,AG32<=75),\"Disminuye el Impacto en 1\",IF(AND(AG32>75,AG32<=100),\"Disminuye el Impacto en 2\",\"\")))))","v":"Disminuye la Probabilidad en 2"},2,{"$nulls":7},"en caso de fallos electricos  y  que la bateria de las ups este agotada, deben apagarse los equipos de red para evitar fallas en su funcionamiento ","verificar el tiempo de vida de las UPS, e iniciar  apagado progresivo de equipos según la prioridad de los servicios. ","Area de Servidores y servicios de internet, Area de infraestructura","2015-01-01","2015-12-31","Reporte de fallos",null,{"$f":"IF(R31=\"Afecta la Probabilidad\",AW32-(AW32-AI32),\"No aplica\")","v":2},null,{"$f":"IF(R31=\"Afecta el Impacto\",AY32-(AY32-AI32),\"No aplica\")","v":"No aplica"},{"$f":"IF([1]Matriz!R31=\"Afecta el Impacto\",CONCATENATE(AW32,AZ32),CONCATENATE(AX32,AY32))","v":"No aplica"}]
[null,7,"Factor_Interno","Personal","Errores de actualización y/o mantenimiento de equipos ",{"$nulls":14},{"$f":"IF(S33=\"Si\",15,0)","v":0},null,0,null,0,null,0,null,0,null,0,null,0,0,{"$f":"IF(R32=\"\",\"\",IF(R32=\"Afecta la Probabilidad\",IF(AND(AG33>=0,AG33<=50),\"No disminuye la Probabilidad\",IF(AND(AG33>50,AG33<=75),\"Disminuye la Probabilidad en 1\",IF(AND(AG33>75,AG33<=100),\"Disminuye la Probabilidad en 2\",\"\"))),IF(AND(AG33>=0,AG33<=50),\"No disminuye el Impacto\",IF(AND(AG33>50,AG33<=75),\"Disminuye el Impacto en 1\",IF(AND(AG33>75,AG33<=100),\"Disminuye el Impacto en 2\",\"\")))))","v":"No disminuye el Impacto"},0,{"$nulls":7},"La planta del centro de datos del IPET se encuentra instalada pero de fuera de funcionamiento","Solicitar la puesta en funcionamiento de la planta del IPET","Jefatura de TIC, Vicerrectoría Adminsitrativa","2016-01-01","2016-01-06",null,null,{"$f":"IF(R32=\"Afecta la Probabilidad\",AW33-(AW33-AI33),\"No aplica\")","v":"No aplica"},null,{"$f":"IF(R32=\"Afecta el Impacto\",AY33-(AY33-AI33),\"No aplica\")","v":0},{"$f":"IF([1]Matriz!R32=\"Afecta el Impacto\",CONCATENATE(AW33,AZ33),CONCATENATE(AX33,AY33))","v":"No aplica"}]
[null,8,{"$nulls":17},0,null,0,null,0,null,0,null,0,null,0,null,0,0,{"$f":"IF(R34=\"\",\"\",IF(R34=\"Afecta la Probabilidad\",IF(AND(AG34>=0,AG34<=50),\"No disminuye la Probabilidad\",IF(AND(AG34>50,AG34<=75),\"Disminuye la Probabilidad en 1\",IF(AND(AG34>75,AG34<=100),\"Disminuye la Probabilidad en 2\",\"\"))),IF(AND(AG34>=0,AG34<=50),\"No disminuye el Impacto\",IF(AND(AG34>50,AG34<=75),\"Disminuye el Impacto en 1\",IF(AND(AG34>75,AG34<=100),\"Disminuye el Impacto en 2\",\"\")))))","v":""},0,{"$nulls":7},"ausencia de sistema de control de incendios","Adquirir un sistema de control de incendios adecuado para un centro de datos.","Jefatura de TIC, Vicerrectoría Adminsitrativa","2016-01-01","2016-01-06",null,null,"No aplica",null,"No aplica",{"$f":"IF([1]Matriz!R34=\"Afecta el Impacto\",CONCATENATE(AW34,AZ34),CONCATENATE(AX34,AY34))","v":"No aplica"}]
[null,9,{"$nulls":17},0,null,0,null,0,null,0,null,0,null,0,null,0,0,{"$f":"IF(R35=\"\",\"\",IF(R35=\"Afecta la Probabilidad\",IF(AND(AG35>=0,AG35<=50),\"No disminuye la Probabilidad\",IF(AND(AG35>50,AG35<=75),\"Disminuye la Probabilidad en 1\",IF(AND(AG35>75,AG35<=100),\"Disminuye la Probabilidad en 2\",\"\"))),IF(AND(AG35>=0,AG35<=50),\"No disminuye el Impacto\",IF(AND(AG35>50,AG35<=75),\"Disminuye el Impacto en 1\",IF(AND(AG35>75,AG35<=100),\"Disminuye el Impacto en 2\",\"\")))))","v":""},0,{"$nulls":7},"Se presenta Humedad en las instalaciones del centro de datos del IPET","Solcitar al area de edificios el arreglo correspondiente.","Jefatura de TIC, Vicerrectoría Adminsitrativa","2016-01-01","2016-01-06",null,null,"No aplica",null,"No aplica",{"$f":"IF([1]Matriz!R35=\"Afecta el Impacto\",CONCATENATE(AW35,AZ35),CONCATENATE(AX35,AY35))","v":"No aplica"}]
["R4",1,"Factor_Externo","Económicos","Falta de dispositivos de seguridad","Acceso no autorizado a la información","Pérdida de información",4,{"$f":"IF(H36=5,\"Mas de una vez al año\",IF(H36=4,\"Al menos una vez en el ultimo año\",IF(H36=3,\"Al menos una vez en los ultimos 2 años\",IF(H36=2,\"Al menos una vez en los ultimos 5 años\",\"No se ha presentado en los ultimos 5 años\"))))","v":"Al menos una vez en el ultimo año"},{"$f":"CONCATENATE(H$36,K$36)","v":"45"},5,{"$f":"IF(K36=5,\"Catastrófico\",IF(K36=4,\"Mayor\",IF(K36=3,\"Moderado\",IF(K36=2,\"Menos\",IF(K36=1,\"Insignificante\",\"Digite Valor entre 1 y 5\")))))","v":"Catastrófico"},{"$f":"IF(L36=\"Digite Valor entre 1 y 5\",\"\",IF(COUNTIF(CE$10:CE$17,CONCATENATE(H36,K36)),CE$9,IF(COUNTIF(CF$10:CF$17,CONCATENATE(H36,K36)),CF$9,IF(COUNTIF(CG$10:CG$13,CONCATENATE(H36,K36)),CG$9,CH$9))))","v":"Zona de Riesgo Extrema"},{"$f":"IF(M36=CE$9,\"E\",IF(M36=CF$9,\"A\",IF(M36=CG$9,\"M\",IF(M36=CH$9,\"B\",\"\"))))","v":"E"},"Control Preventivo","Estudio tecnico y presentación de la necesidad de dispositivos en el plan de compras","A Solicitud","Afecta la Probabilidad","Si",15,"Si",5,"No",0,"Si",10,"No",0,"Si",10,"No",{"$f":"IF(AE36=\"Si\",30,0)","v":0},40,{"$f":"IF(R36=\"\",\"\",IF(R36=\"Afecta la Probabilidad\",IF(AND(AG36>=0,AG36<=50),\"No disminuye la Probabilidad\",IF(AND(AG36>50,AG36<=75),\"Disminuye la Probabilidad en 1\",IF(AND(AG36>75,AG36<=100),\"Disminuye la Probabilidad en 2\",\"\"))),IF(AND(AG36>=0,AG36<=50),\"No disminuye el Impacto\",IF(AND(AG36>50,AG36<=75),\"Disminuye el Impacto en 1\",IF(AND(AG36>75,AG36<=100),\"Disminuye el Impacto en 2\",\"\")))))","v":"No disminuye la Probabilidad"},0,{"$f":"BD36","v":1},{"$f":"IF(AJ36=5,\"Mas de una vez al año\",IF(AJ36=4,\"Al menos una vez en el ultimo año\",IF(AJ36=3,\"Al menos una vez en los ultimos 2 años\",IF(AJ36=2,\"Al menos una vez en los ultimos 5 años\",\"No se ha presentado en los ultimos 5 años\"))))","v":"No se ha presentado en los ultimos 5 años"},{"$f":"BF36","v":4},{"$f":"IF(AL36=5,\"Catastrófico - Tendría desastrosas consecuencias o efectos sobre la institución\",IF(AL36=4,\"Mayor - Tendría altas consecuencias o efectos sobre la institución\",IF(AL36=3,\"Moderado - Tendría medianas consecuencias o efectos sobre la institución\",IF(AL36=2,\"Menos - Tendría bajo impacto o efecto sobre la institución\",IF(AL36=1,\"Insignificante - tendría consecuencias o efectos mínimos en la institución\",\"Digite Valor entre 1 y 5\")))))","v":"Mayor - Tendría altas consecuencias o efectos sobre la institución"},{"$f":"CONCATENATE(AJ36,AL36)","v":"14"},{"$f":"IF(COUNTIF($CE$10:$CE$17,AN36),$CE$9,IF(COUNTIF($CF$10:$CF$17,AN36),$CF$9,IF(COUNTIF($CG$10:$CG$13,AN36),$CG$9,IF(COUNTIF($CH$10:$CH$14,AN36),$CH$9,\"\"))))","v":"Zona de Riesgo Alta"},{"$f":"IF(AO36=$CE$9,\"E\",IF(AO36=$CF$9,\"A\",IF(AO36=$CG$9,\"M\",IF(AO36=$CH$9,\"B\",\"\"))))","v":"A"},"La necesidad de adquisición de los elementos y licencias respectivas no es anual, pero se debe tener en cuenta los problemas de funcionamiento que se presenten y/o la vigencia de las licencias respectivas, con el fin de que la seguridad no se vea afectada .","Adquirir dispositivos de seguridad, como cortafuegos, Appliance,  Switches entre otros. ","Área de servidores - Área de infraestructura - Jefatura de la División TIC","2016-01-01","31/06/2016","Acta de requerimientos. Solicitud de CDP",4,0,5,"No aplica",{"$f":"IF([1]Matriz!R36=\"Afecta el Impacto\",CONCATENATE(AW36,AZ36),CONCATENATE(AX36,AY36))","v":"05"},{"$f":"IF(R36=\"\",\"\",SUMIF(R36:R44,\"Afecta la Probabilidad\",AX36:AX44))","v":4},{"$f":"IF(R36=\"\",\"\",SUMIF(R36:R44,\"Afecta el Impacto\",AZ36:AZ44))","v":1},{"$f":"IF(BB36=\"\",\"\",IF(H36-BB36<=0,1,H36-BB36))","v":1},{"$f":"CONCATENATE(BD36,BF36)","v":"14"},{"$f":"IF(K36=\"\",\"\",IF(K36-BC36<0,1,K36-BC36))","v":4}]
[null,{"$f":"B36+1","v":2},"Factor_del_Proceso","Procedimientos asociados","Vencimiento de licencias de dispositivos de seguridad",null,"Alteración de la información",{"$nulls":7},"Control Preventivo","Análisis del nivel de seguridad requerido por los sistemas e implementación de medidas en software y hardware","A Solicitud","Afecta la Probabilidad","Si",15,"Si",5,"No",0,"Si",10,"Si",15,"Si",10,"Si",30,85,{"$f":"IF(R37=\"\",\"\",IF(R37=\"Afecta la Probabilidad\",IF(AND(AG37>=0,AG37<=50),\"No disminuye la Probabilidad\",IF(AND(AG37>50,AG37<=75),\"Disminuye la Probabilidad en 1\",IF(AND(AG37>75,AG37<=100),\"Disminuye la Probabilidad en 2\",\"\"))),IF(AND(AG37>=0,AG37<=50),\"No disminuye el Impacto\",IF(AND(AG37>50,AG37<=75),\"Disminuye el Impacto en 1\",IF(AND(AG37>75,AG37<=100),\"Disminuye el Impacto en 2\",\"\")))))","v":"Disminuye la Probabilidad en 2"},2,{"$nulls":7},"La aplicación de políticas de seguridad en los cortafuegos y en la configuración de los sistemas de información es realizada por el Área de Servidores, mientras que la aplicación de medidas en los switches es realizada por el área de Infraestructura.","Aplicación de políticas de seguridad, segmentación de la red, mecanismos de seguridad local (Hardening).","Área de servidores - Área de infraestructura","2015-01-01","2015-12-31","Manuales de configuración de servicios, hoja de vida de servidores",null,2,null,"No aplica",{"$f":"IF([1]Matriz!R37=\"Afecta el Impacto\",CONCATENATE(AW37,AZ37),CONCATENATE(AX37,AY37))","v":"No aplica"}]
[null,{"$f":"B37+1","v":3},"Factor_Interno","Tecnología","Insuficientes Mecanismos de seguridad implementados",null,"Información confidencial de la institución en manos de un tercero",{"$nulls":7},"Control Correctivo","Revisión y rectificación de la configuración","A Solicitud","Afecta el Impacto","Si",15,"Si",5,"No",0,"Si",10,"No",0,"Si",10,"Si",30,70,{"$f":"IF(R38=\"\",\"\",IF(R38=\"Afecta la Probabilidad\",IF(AND(AG38>=0,AG38<=50),\"No disminuye la Probabilidad\",IF(AND(AG38>50,AG38<=75),\"Disminuye la Probabilidad en 1\",IF(AND(AG38>75,AG38<=100),\"Disminuye la Probabilidad en 2\",\"\"))),IF(AND(AG38>=0,AG38<=50),\"No disminuye el Impacto\",IF(AND(AG38>50,AG38<=75),\"Disminuye el Impacto en 1\",IF(AND(AG38>75,AG38<=100),\"Disminuye el Impacto en 2\",\"\")))))","v":"Disminuye el Impacto en 1"},1,{"$nulls":8},"Revisión del inconveniente y aplicación de medidas correctivas","Área de servidores ","2015-01-01","2015-12-31","Registros de modificación en dispositivos",null,"No aplica",null,1,{"$f":"IF([1]Matriz!R38=\"Afecta el Impacto\",CONCATENATE(AW38,AZ38),CONCATENATE(AX38,AY38))","v":"No aplica"}]
[null,4,"Factor_Interno","Personal","Errores de configuración de los sistemas de seguridad",null,"Desconfianza institucional",{"$nulls":7},"Control Preventivo","Actualización de los paquetes e instalación de parches de seguridad","A Solicitud","Afecta la Probabilidad","Si",15,"Si",5,"No",0,"Si",10,"Si",15,"Si",10,"Si",30,85,{"$f":"IF(R39=\"\",\"\",IF(R39=\"Afecta la Probabilidad\",IF(AND(AG39>=0,AG39<=50),\"No disminuye la Probabilidad\",IF(AND(AG39>50,AG39<=75),\"Disminuye la Probabilidad en 1\",IF(AND(AG39>75,AG39<=100),\"Disminuye la Probabilidad en 2\",\"\"))),IF(AND(AG39>=0,AG39<=50),\"No disminuye el Impacto\",IF(AND(AG39>50,AG39<=75),\"Disminuye el Impacto en 1\",IF(AND(AG39>75,AG39<=100),\"Disminuye el Impacto en 2\",\"\")))))","v":"Disminuye la Probabilidad en 2"},2,{"$nulls":7},"El área de servidores está en las listas de distribución de correo electrónico de las actualizaciones de seguridad del sistema operativo Linux Debian, donde se informan las versiones más recientes de los paquetes instalados en los sistemas. La instalación de estos queda consignada en la hoja de vida de cada servidor y se realiza en momentos donde no afecte a los usuarios.","Actualización de los paquetes e instalación de parches de seguridad","Área de servidores ","2015-01-01","2015-12-31","Hoja de vida de servidores",null,2,null,"No aplica",{"$f":"IF([1]Matriz!R39=\"Afecta el Impacto\",CONCATENATE(AW39,AZ39),CONCATENATE(AX39,AY39))","v":"2"}]
[null,5,"Factor_Interno","Tecnología","Mal funcionamiento de los sistemas de seguridad",{"$nulls":14},0,null,0,null,0,null,0,null,0,null,0,null,0,0,"",0,{"$nulls":14},"No aplica",null,"No aplica",{"$f":"IF([1]Matriz!R40=\"Afecta el Impacto\",CONCATENATE(AW40,AZ40),CONCATENATE(AX40,AY40))","v":"No aplica"}]
[null,6,{"$nulls":17},0,null,0,null,0,null,0,null,0,null,0,null,0,0,"",0,{"$nulls":14},"No aplica",null,"No aplica",{"$f":"IF([1]Matriz!R41=\"Afecta el Impacto\",CONCATENATE(AW41,AZ41),CONCATENATE(AX41,AY41))","v":"No aplica"}]
[null,7,{"$nulls":17},0,null,0,null,0,null,0,null,0,null,0,null,0,0,"",0,{"$nulls":14},"No aplica",null,"No aplica",{"$f":"IF([1]Matriz!R42=\"Afecta el Impacto\",CONCATENATE(AW42,AZ42),CONCATENATE(AX42,AY42))","v":"No aplica"}]
[null,8,{"$nulls":17},0,null,0,null,0,null,0,null,0,null,0,null,0,0,"",0,{"$nulls":14},"No aplica",null,"No aplica",{"$f":"IF([1]Matriz!R43=\"Afecta el Impacto\",CONCATENATE(AW43,AZ43),CONCATENATE(AX43,AY43))","v":"No aplica"}]
[null,9,{"$nulls":17},0,null,0,null,0,null,0,null,0,null,0,null,0,0,"",0,{"$nulls":14},"No aplica",null,"No aplica",{"$f":"IF([1]Matriz!R44=\"Afecta el Impacto\",CONCATENATE(AW44,AZ44),CONCATENATE(AX44,AY44))","v":"No aplica"}]
["R5",1,"Factor_Externo","Económicos","Falta de recursos tecnológicos","Indisponibilidad en la prestación de un servicio","Pérdida de información",5,{"$f":"IF(H45=5,\"Mas de una vez al año\",IF(H45=4,\"Al menos una vez en el ultimo año\",IF(H45=3,\"Al menos una vez en los ultimos 2 años\",IF(H45=2,\"Al menos una vez en los ultimos 5 años\",\"No se ha presentado en los ultimos 5 años\"))))","v":"Mas de una vez al año"},{"$f":"CONCATENATE(H$45,K$45)","v":"54"},4,{"$f":"IF(K45=5,\"Catastrófico\",IF(K45=4,\"Mayor\",IF(K45=3,\"Moderado\",IF(K45=2,\"Menos\",IF(K45=1,\"Insignificante\",\"Digite Valor entre 1 y 5\")))))","v":"Mayor"},{"$f":"IF(L45=\"Digite Valor entre 1 y 5\",\"\",IF(COUNTIF(CE$10:CE$17,CONCATENATE(H45,K45)),CE$9,IF(COUNTIF(CF$10:CF$17,CONCATENATE(H45,K45)),CF$9,IF(COUNTIF(CG$10:CG$13,CONCATENATE(H45,K45)),CG$9,CH$9))))","v":"Zona de Riesgo Extrema"},{"$f":"IF(M45=CE$9,\"E\",IF(M45=CF$9,\"A\",IF(M45=CG$9,\"M\",IF(M45=CH$9,\"B\",\"\"))))","v":"E"},"Control Preventivo","Plan de compras","Anual","Afecta la Probabilidad","Si",15,"Si",5,"No",0,"Si",10,"No",0,"Si",10,"No",0,40,"No disminuye la Probabilidad",0,{"$f":"BD45","v":3},{"$f":"IF(AJ45=5,\"Mas de una vez al año\",IF(AJ45=4,\"Al menos una vez en el ultimo año\",IF(AJ45=3,\"Al menos una vez en los ultimos 2 años\",IF(AJ45=2,\"Al menos una vez en los ultimos 5 años\",\"No se ha presentado en los ultimos 5 años\"))))","v":"Al menos una vez en los ultimos 2 años"},{"$f":"BF45","v":3},{"$f":"IF(AL45=5,\"Catastrófico - Tendría desastrosas consecuencias o efectos sobre la institución\",IF(AL45=4,\"Mayor - Tendría altas consecuencias o efectos sobre la institución\",IF(AL45=3,\"Moderado - Tendría medianas consecuencias o efectos sobre la institución\",IF(AL45=2,\"Menos - Tendría bajo impacto o efecto sobre la institución\",IF(AL45=1,\"Insignificante - tendría consecuencias o efectos mínimos en la institución\",\"Digite Valor entre 1 y 5\")))))","v":"Moderado - Tendría medianas consecuencias o efectos sobre la institución"},{"$f":"CONCATENATE(AJ45,AL45)","v":"33"},{"$f":"IF(COUNTIF($CE$10:$CE$17,AN45),$CE$9,IF(COUNTIF($CF$10:$CF$17,AN45),$CF$9,IF(COUNTIF($CG$10:$CG$13,AN45),$CG$9,IF(COUNTIF($CH$10:$CH$14,AN45),$CH$9,\"\"))))","v":"Zona de Riesgo Alta"},{"$f":"IF(AO45=$CE$9,\"E\",IF(AO45=$CF$9,\"A\",IF(AO45=$CG$9,\"M\",IF(AO45=$CH$9,\"B\",\"\"))))","v":"A"},"La necesidad de adquisición de servidores y licencias software no es anual, pero se debe tener en cuenta los requerimientos de la comunidad universitaria.","Adquirir servidores, licencias y elementos necesarios para la adecuada prestación del servicio..","Jefatura TIC, \nVicerrectoría Administrativa","2015-01-01","2015-12-31","Acta y solicitud formal del CDP",5,0,4,"No aplica",{"$f":"IF([1]Matriz!R45=\"Afecta el Impacto\",CONCATENATE(AW45,AZ45),CONCATENATE(AX45,AY45))","v":"04"},{"$f":"IF(R45=\"\",\"\",SUMIF(R45:R53,\"Afecta la Probabilidad\",AX45:AX53))","v":2},{"$f":"IF(R45=\"\",\"\",SUMIF(R45:R53,\"Afecta el Impacto\",AZ45:AZ53))","v":1},{"$f":"IF(BB45=\"\",\"\",IF(H45-BB45<=0,1,H45-BB45))","v":3},{"$f":"CONCATENATE(BD45,BF45)","v":"33"},{"$f":"IF(K45=\"\",\"\",IF(K45-BC45<0,1,K45-BC45))","v":3}]
[null,{"$f":"B45+1","v":2},"Factor_Interno","Tecnología","Error del sistema (software)",null,"afectación de procesos académicos y administrativos",{"$nulls":7},"Control Preventivo","Manteniemiento de sistemas operativos y software instalado.","Semestral","Afecta la Probabilidad","No",0,"Si",5,"No",0,"Si",10,"No",0,"Si",10,"No",0,25,"No disminuye la Probabilidad",0,{"$nulls":8},"Instalación de actualizaciones para sistema operativo y plataformas software. Limpieza de archivos temporales y alamacenamiento de registros log.","Area de servidores y servicios de Internet","2015-01-01","2015-12-31","Logs de sistema. Hoja de vida de servidor",null,0,null,"No aplica",{"$f":"IF([1]Matriz!R46=\"Afecta el Impacto\",CONCATENATE(AW46,AZ46),CONCATENATE(AX46,AY46))","v":"0"}]
[null,3,"Factor_Interno","Tecnología","Error del sistema (hardware)",null,"insatisfacción de usuarios.",{"$nulls":7},"Control Preventivo","Mantenimiento de equipos ","Anual","Afecta la Probabilidad","Si",15,"Si",5,"No",0,"Si",10,"No",0,"Si",10,"Si",30,70,"Disminuye la Probabilidad en 1",1,{"$nulls":8},"Limpieza de equipos","Area de servidores y servicios de Internet","2015-01-01","2015-12-31","Reporte de actividades de mantenimiento",null,1,null,"No aplica",{"$f":"IF([1]Matriz!R47=\"Afecta el Impacto\",CONCATENATE(AW47,AZ47),CONCATENATE(AX47,AY47))","v":"1"}]
[null,4,"Factor_Interno","Personal","Error de configuración",null,"Pérdida de credibilidad",{"$nulls":7},"Control Preventivo","Establecimiento de redundancia de red a nivel de CORE y esquemas de alta disponibilidad","A Solicitud","Afecta la Probabilidad","No",0,"Si",5,"No",0,"Si",10,"Si",15,"No",0,"Si",30,60,"Disminuye la Probabilidad en 1",1,{"$nulls":7},"la redundancia existe entre cortafuegos y core de red","Verificación de de esquema de redundancia ","Area de servidores y servicios de Internet","2015-01-01","2015-12-31",null,null,1,null,"No aplica",{"$f":"IF([1]Matriz!R48=\"Afecta el Impacto\",CONCATENATE(AW48,AZ48),CONCATENATE(AX48,AY48))","v":"1"}]
[null,5,"Factor_Interno","Tecnología","Fallo de red",{"$nulls":13},"No",0,"No",0,"No",0,"No",0,"No",0,"No",0,"No",0,0,"",0,{"$nulls":7},"los servicios para los cuales se ha implementado la alta disponibilidad son Portal Web, DHCP, DNS, SIMCA, Desprendible de pago y Servidores Proxy","Configuración de cluster de diponibilidad para los servicios ","Area de servidores y servicios de Internet","2015-01-01","2015-12-31","Manual de instalacion y configuracion de servidores y hoja de vida de servidor ",null,"No aplica",null,"No aplica",{"$f":"IF([1]Matriz!R49=\"Afecta el Impacto\",CONCATENATE(AW49,AZ49),CONCATENATE(AX49,AY49))","v":"No aplica"}]
[null,6,"Factor_del_Proceso","Procedimientos asociados","Fallo en el suministro eléctrico",{"$nulls":9},"Control Correctivo","Restauración de servidor, configuraciones, o información a partir de copias de respaldo","A Solicitud","Afecta el Impacto","Si",15,"Si",5,"No",0,"Si",10,"Si",15,"Si",10,"No",0,55,"Disminuye el Impacto en 1",1,{"$nulls":7},"Acciones asociadas a el procedimiento de Creación y verificación de copias de seguridad de los sitemas de Información",null,"Area de servidores y servicios de Internet","2015-01-01","2015-12-31","Funcionamiento de la copia en el sistema de acuerdo al instructivo, reporte de actividades.",null,"No aplica",null,1,{"$f":"IF([1]Matriz!R50=\"Afecta el Impacto\",CONCATENATE(AW50,AZ50),CONCATENATE(AX50,AY50))","v":"No aplica"}]
[null,7,"Factor_del_Proceso","Procedimientos asociados","Acceso no autorizado a la información",{"$nulls":9},"Control Correctivo",{"$nulls":3},"No",0,"No",0,"No",0,"No",0,"No",0,"No",0,"No",0,0,"",0,{"$nulls":14},"No aplica",null,"No aplica",{"$f":"IF([1]Matriz!R51=\"Afecta el Impacto\",CONCATENATE(AW51,AZ51),CONCATENATE(AX51,AY51))","v":"No aplica"}]
[null,8,"Factor_Externo","Económicos","No adquisicion de licencias de funcionamiento ",{"$nulls":9},"Control Correctivo","Aplicación de servicio de garantía","A Solicitud","Afecta el Impacto","Si",15,"Si",5,"No",0,"Si",10,"No",0,"Si",10,"No",0,40,"No disminuye el Impacto",0,{"$nulls":7},"En los casos que el periodo de garantia este vigente, se hace efectiva con el proveedor ","Contactar y seguir proceso con el proveedor","Area de servidores y servicios de Internet","2015-01-01","2015-12-31","Correos electronicos, Hoja de vida del servidor",null,"No aplica",null,0,{"$f":"IF([1]Matriz!R52=\"Afecta el Impacto\",CONCATENATE(AW52,AZ52),CONCATENATE(AX52,AY52))","v":"No aplica"}]
[null,9,{"$nulls":17},0,null,0,null,0,null,0,null,0,null,0,null,0,0,"",0,{"$nulls":14},"No aplica",null,"No aplica",{"$f":"IF([1]Matriz!R53=\"Afecta el Impacto\",CONCATENATE(AW53,AZ53),CONCATENATE(AX53,AY53))","v":"No aplica"}]
["R6",1,"Factor_Interno","Tecnología","Obsolecencia en el sistema de resplado (Planta electrica, etc..)","Interrupciones en el suministro del fluido electrico","Pérdidas en la continuidad del servicio",3,{"$f":"IF(H54=5,\"Mas de una vez al año\",IF(H54=4,\"Al menos una vez en el ultimo año\",IF(H54=3,\"Al menos una vez en los ultimos 2 años\",IF(H54=2,\"Al menos una vez en los ultimos 5 años\",\"No se ha presentado en los ultimos 5 años\"))))","v":"Al menos una vez en los ultimos 2 años"},{"$f":"CONCATENATE(H$54,K$54)","v":"34"},4,{"$f":"IF(K54=5,\"Catastrófico\",IF(K54=4,\"Mayor\",IF(K54=3,\"Moderado\",IF(K54=2,\"Menos\",IF(K54=1,\"Insignificante\",\"Digite Valor entre 1 y 5\")))))","v":"Mayor"},{"$f":"IF(L54=\"Digite Valor entre 1 y 5\",\"\",IF(COUNTIF(CE$10:CE$17,CONCATENATE(H54,K54)),CE$9,IF(COUNTIF(CF$10:CF$17,CONCATENATE(H54,K54)),CF$9,IF(COUNTIF(CG$10:CG$13,CONCATENATE(H54,K54)),CG$9,CH$9))))","v":"Zona de Riesgo Extrema"},{"$f":"IF(M54=CE$9,\"E\",IF(M54=CF$9,\"A\",IF(M54=CG$9,\"M\",IF(M54=CH$9,\"B\",\"\"))))","v":"E"},"Control Preventivo","Plan de renovación de equipos de resplado electricos","Anual","Afecta la Probabilidad","No",0,"No",0,"No",0,"Si",10,"Si",15,"No",0,"No",{"$f":"IF(AE54=\"Si\",30,0)","v":0},25,{"$f":"IF(R54=\"\",\"\",IF(R54=\"Afecta la Probabilidad\",IF(AND(AG54>=0,AG54<=50),\"No disminuye la Probabilidad\",IF(AND(AG54>50,AG54<=75),\"Disminuye la Probabilidad en 1\",IF(AND(AG54>75,AG54<=100),\"Disminuye la Probabilidad en 2\",\"\"))),IF(AND(AG54>=0,AG54<=50),\"No disminuye el Impacto\",IF(AND(AG54>50,AG54<=75),\"Disminuye el Impacto en 1\",IF(AND(AG54>75,AG54<=100),\"Disminuye el Impacto en 2\",\"\")))))","v":"No disminuye la Probabilidad"},{"$f":"IF(AG54<=50,0,IF(AND(AG54>50,AG54<=75),1,IF(AND(AG54>75,AG54<=100),2,\"\")))","v":0},{"$f":"BD54","v":3},{"$f":"IF(AJ54=5,\"Mas de una vez al año\",IF(AJ54=4,\"Al menos una vez en el ultimo año\",IF(AJ54=3,\"Al menos una vez en los ultimos 2 años\",IF(AJ54=2,\"Al menos una vez en los ultimos 5 años\",\"No se ha presentado en los ultimos 5 años\"))))","v":"Al menos una vez en los ultimos 2 años"},{"$f":"BF54","v":4},{"$f":"IF(AL54=5,\"Catastrófico - Tendría desastrosas consecuencias o efectos sobre la institución\",IF(AL54=4,\"Mayor - Tendría altas consecuencias o efectos sobre la institución\",IF(AL54=3,\"Moderado - Tendría medianas consecuencias o efectos sobre la institución\",IF(AL54=2,\"Menos - Tendría bajo impacto o efecto sobre la institución\",IF(AL54=1,\"Insignificante - tendría consecuencias o efectos mínimos en la institución\",\"Digite Valor entre 1 y 5\")))))","v":"Mayor - Tendría altas consecuencias o efectos sobre la institución"},{"$f":"CONCATENATE(AJ54,AL54)","v":"34"},{"$f":"IF(COUNTIF($CE$10:$CE$17,AN54),$CE$9,IF(COUNTIF($CF$10:$CF$17,AN54),$CF$9,IF(COUNTIF($CG$10:$CG$13,AN54),$CG$9,IF(COUNTIF($CH$10:$CH$14,AN54),$CH$9,\"\"))))","v":"Zona de Riesgo Extrema"},{"$f":"IF(AO54=$CE$9,\"E\",IF(AO54=$CF$9,\"A\",IF(AO54=$CG$9,\"M\",IF(AO54=$CH$9,\"B\",\"\"))))","v":"E"},"El control no existe, se debe implementar","Se debe generar, gestionar y ejecutar el plan de renovación de equipos de respaldos electricos","División Administrativa y de Servicios","2016-01-01","Indefinido","Plan de renovación de equipos",{"$f":"H54","v":3},{"$f":"IF(R54=\"Afecta la Probabilidad\",AW54-(AW54-AI54),\"No aplica\")","v":0},{"$f":"K54","v":4},"No aplica",{"$f":"IF([2]Matriz!R55=\"Afecta el Impacto\",CONCATENATE(AW54,AZ54),CONCATENATE(AX54,AY54))","v":"04"},{"$f":"IF(R54=\"\",\"\",SUMIF(R54:R62,\"Afecta la Probabilidad\",AX54:AX62))","v":0},{"$f":"IF(R54=\"\",\"\",SUMIF(R54:R62,\"Afecta el Impacto\",AZ54:AZ62))","v":0},{"$f":"IF(BB54=\"\",\"\",IF(H54-BB54<=0,1,H54-BB54))","v":3},{"$f":"CONCATENATE(BD54,BF54)","v":"34"},{"$f":"IF(K54=\"\",\"\",IF(K54-BC54<0,1,K54-BC54))","v":4},{"$nulls":24},{"$f":"COUNTIF(CE10:CE17,CONCATENATE(H9,K9))","v":1},{"$f":"COUNTIF(CF10:CF17,CONCATENATE(H9,K9))","v":0},{"$f":"COUNTIF(CG10:CG17,CONCATENATE(I9,L9))","v":0},{"$f":"COUNTIF(CH10:CH17,CONCATENATE(J9,M9))","v":0}]
[null,2,"Factor_Interno","Procesos","Falta de mantenimiento",null,"Caidas abruptas de la base de datos",{"$nulls":7},"Control Preventivo","Plan de mantemineto de equipos electricos","Semestral","Afecta la Probabilidad","No",0,"No",0,"No",0,"Si",10,"Si",15,"No",0,"No",{"$f":"IF(AE55=\"Si\",30,0)","v":0},25,{"$f":"IF(R55=\"\",\"\",IF(R55=\"Afecta la Probabilidad\",IF(AND(AG55>=0,AG55<=50),\"No disminuye la Probabilidad\",IF(AND(AG55>50,AG55<=75),\"Disminuye la Probabilidad en 1\",IF(AND(AG55>75,AG55<=100),\"Disminuye la Probabilidad en 2\",\"\"))),IF(AND(AG55>=0,AG55<=50),\"No disminuye el Impacto\",IF(AND(AG55>50,AG55<=75),\"Disminuye el Impacto en 1\",IF(AND(AG55>75,AG55<=100),\"Disminuye el Impacto en 2\",\"\")))))","v":"No disminuye la Probabilidad"},{"$f":"IF(AG55<=50,0,IF(AND(AG55>50,AG55<=75),1,IF(AND(AG55>75,AG55<=100),2,\"\")))","v":0},{"$nulls":7},"El control no existe, se debe implementar","Se debe generar, gestionar y ejecutar el plan de  mantenimiento de equipos eléctricos","División Administrativa y de Servicios","2016-01-01","Indefinido","Plan de mantenimiento de equipos",null,{"$f":"IF(R55=\"Afecta la Probabilidad\",AW55-(AW55-AI55),\"No aplica\")","v":0},null,"No aplica",{"$f":"IF([2]Matriz!R56=\"Afecta el Impacto\",CONCATENATE(AW55,AZ55),CONCATENATE(AX55,AY55))","v":"0"}]
[null,3,"Factor_Externo","Tecnológicos","Problemas con el proveedor del servicio",null,"Daño de objetos en la configuración de la base de datos",{"$nulls":7},"Control Correctivo","Plan de comunicación para poner en marcha la contigencia","Anual","Afecta el Impacto","No",0,"No",0,"No",0,"Si",10,"Si",15,"No",0,"No",{"$f":"IF(AE56=\"Si\",30,0)","v":0},25,{"$f":"IF(R56=\"\",\"\",IF(R56=\"Afecta la Probabilidad\",IF(AND(AG56>=0,AG56<=50),\"No disminuye la Probabilidad\",IF(AND(AG56>50,AG56<=75),\"Disminuye la Probabilidad en 1\",IF(AND(AG56>75,AG56<=100),\"Disminuye la Probabilidad en 2\",\"\"))),IF(AND(AG56>=0,AG56<=50),\"No disminuye el Impacto\",IF(AND(AG56>50,AG56<=75),\"Disminuye el Impacto en 1\",IF(AND(AG56>75,AG56<=100),\"Disminuye el Impacto en 2\",\"\")))))","v":"No disminuye el Impacto"},0,{"$nulls":7},"El control no existe, se debe implementar","Se debe generar, gestionar y ejecutar el plan de   comunicación entre proveedores del servicio eléctrico y la Universidad","Division de Tecnologias de la Información","2016-01-01","Indefinido","Plan de comunicación",null,{"$f":"IF(R56=\"Afecta la Probabilidad\",AW56-(AW56-AI56),\"No aplica\")","v":"No aplica"},null,0,{"$f":"IF([2]Matriz!R57=\"Afecta el Impacto\",CONCATENATE(AW56,AZ56),CONCATENATE(AX56,AY56))","v":"No aplica"}]
[null,4,"Factor_Interno","Tecnología","Problemas con las antenas a tierras",null,"Genaración de  estados inconsitentes en la base de datos",{"$nulls":7},"Control Correctivo","Revisar y mejorar polos a tierra en los edificios universitarios","Anual","Afecta el Impacto","No",0,"No",0,"No",0,"Si",10,"Si",15,"No",0,"No",{"$f":"IF(AE57=\"Si\",30,0)","v":0},25,{"$f":"IF(R57=\"\",\"\",IF(R57=\"Afecta la Probabilidad\",IF(AND(AG57>=0,AG57<=50),\"No disminuye la Probabilidad\",IF(AND(AG57>50,AG57<=75),\"Disminuye la Probabilidad en 1\",IF(AND(AG57>75,AG57<=100),\"Disminuye la Probabilidad en 2\",\"\"))),IF(AND(AG57>=0,AG57<=50),\"No disminuye el Impacto\",IF(AND(AG57>50,AG57<=75),\"Disminuye el Impacto en 1\",IF(AND(AG57>75,AG57<=100),\"Disminuye el Impacto en 2\",\"\")))))","v":"No disminuye el Impacto"},0,{"$nulls":7},"El control no existe, se debe implementar","Realizar el estudio y la contratación para revisar y mejorar los polos a tierra","División Administrativa y de Servicios","2016-01-01","2016-06-30","Estudio de la contrucción de las tierras, Contratación para la construcción de la tierras",null,"No aplica",null,0,{"$f":"IF([2]Matriz!R58=\"Afecta el Impacto\",CONCATENATE(AW57,AZ57),CONCATENATE(AX57,AY57))","v":"No aplica"}]
[null,5,{"$nulls":4},"Problemas en el proceso de copias de seguridad",{"$nulls":12},0,null,0,null,0,null,0,null,0,null,0,null,{"$f":"IF(AE58=\"Si\",30,0)","v":0},0,"",0,{"$nulls":14},"No aplica",null,"No aplica",{"$f":"IF([2]Matriz!R59=\"Afecta el Impacto\",CONCATENATE(AW58,AZ58),CONCATENATE(AX58,AY58))","v":{"$error":"#REF!"}}]
[null,6,{"$nulls":4},"Pérdida de información",{"$nulls":12},0,null,0,null,0,null,0,null,0,null,0,null,0,0,"",0,{"$nulls":14},"No aplica",null,"No aplica"]
[null,7,{"$nulls":17},0,null,0,null,0,null,0,null,0,null,0,null,0,0,"",0,{"$nulls":14},"No aplica",null,"No aplica"]
[null,8,{"$nulls":17},0,null,0,null,0,null,0,null,0,null,0,null,0,0,"",0,{"$nulls":14},"No aplica",null,"No aplica"]
[null,9,{"$nulls":17},0,null,0,null,0,null,0,null,0,null,0,null,0,0,"",0,{"$nulls":14},"No aplica",null,"No aplica",{"$f":"IF([2]Matriz!R63=\"Afecta el Impacto\",CONCATENATE(AW62,AZ62),CONCATENATE(AX62,AY62))","v":"No aplica"}]
["R7",1,"Factor_Interno","Tecnología","Motor de base de datos obsoleto","Copias de seguridad inválidas","Perdidas de información",3,{"$f":"IF(H63=5,\"Mas de una vez al año\",IF(H63=4,\"Al menos una vez en el ultimo año\",IF(H63=3,\"Al menos una vez en los ultimos 2 años\",IF(H63=2,\"Al menos una vez en los ultimos 5 años\",\"No se ha presentado en los ultimos 5 años\"))))","v":"Al menos una vez en los ultimos 2 años"},{"$f":"CONCATENATE(H$63,K$63)","v":"34"},4,{"$f":"IF(K63=5,\"Catastrófico\",IF(K63=4,\"Mayor\",IF(K63=3,\"Moderado\",IF(K63=2,\"Menos\",IF(K63=1,\"Insignificante\",\"Digite Valor entre 1 y 5\")))))","v":"Mayor"},{"$f":"IF(L63=\"Digite Valor entre 1 y 5\",\"\",IF(COUNTIF(CE$10:CE$17,CONCATENATE(H63,K63)),CE$9,IF(COUNTIF(CF$10:CF$17,CONCATENATE(H63,K63)),CF$9,IF(COUNTIF(CG$10:CG$13,CONCATENATE(H63,K63)),CG$9,CH$9))))","v":"Zona de Riesgo Extrema"},{"$f":"IF(M63=CE$9,\"E\",IF(M63=CF$9,\"A\",IF(M63=CG$9,\"M\",IF(M63=CH$9,\"B\",\"\"))))","v":"E"},"Control Correctivo","Verificación de copias de seguridad","Continuo","Afecta la Probabilidad","Si",15,"Si",5,"No",0,"Si",10,"Si",15,"Si",10,"Si",{"$f":"IF(AE63=\"Si\",30,0)","v":30},85,"Disminuye la Probabilidad en 2",2,{"$f":"BD63","v":1},{"$f":"IF(AJ63=5,\"Mas de una vez al año\",IF(AJ63=4,\"Al menos una vez en el ultimo año\",IF(AJ63=3,\"Al menos una vez en los ultimos 2 años\",IF(AJ63=2,\"Al menos una vez en los ultimos 5 años\",\"No se ha presentado en los ultimos 5 años\"))))","v":"No se ha presentado en los ultimos 5 años"},{"$f":"BF63","v":4},{"$f":"IF(AL63=5,\"Catastrófico - Tendría desastrosas consecuencias o efectos sobre la institución\",IF(AL63=4,\"Mayor - Tendría altas consecuencias o efectos sobre la institución\",IF(AL63=3,\"Moderado - Tendría medianas consecuencias o efectos sobre la institución\",IF(AL63=2,\"Menos - Tendría bajo impacto o efecto sobre la institución\",IF(AL63=1,\"Insignificante - tendría consecuencias o efectos mínimos en la institución\",\"Digite Valor entre 1 y 5\")))))","v":"Mayor - Tendría altas consecuencias o efectos sobre la institución"},{"$f":"CONCATENATE(AJ63,AL63)","v":"14"},{"$f":"IF(COUNTIF($CE$10:$CE$17,AN63),$CE$9,IF(COUNTIF($CF$10:$CF$17,AN63),$CF$9,IF(COUNTIF($CG$10:$CG$13,AN63),$CG$9,IF(COUNTIF($CH$10:$CH$14,AN63),$CH$9,\"\"))))","v":"Zona de Riesgo Alta"},{"$f":"IF(AO63=$CE$9,\"E\",IF(AO63=$CF$9,\"A\",IF(AO63=$CG$9,\"M\",IF(AO63=$CH$9,\"B\",\"\"))))","v":"A"},"Unia vez cocluido el proceso de actualización de Finanzas y Recursos Humanos","Validar copias de respaldo de finanzas y Recursos Humanos","DBA's","2016-03-01","Indefinido","Bitacoras de Chequeo de Copias de seguridad",{"$f":"H63","v":3},{"$f":"IF(R63=\"Afecta la Probabilidad\",AW63-(AW63-AI63),\"No aplica\")","v":2},{"$f":"K63","v":4},"No aplica",{"$f":"IF([2]Matriz!R64=\"Afecta el Impacto\",CONCATENATE(AW63,AZ63),CONCATENATE(AX63,AY63))","v":"24"},{"$f":"IF(R63=\"\",\"\",SUMIF(R63:R71,\"Afecta la Probabilidad\",AX63:AX71))","v":6},{"$f":"IF(R63=\"\",\"\",SUMIF(R63:R71,\"Afecta el Impacto\",AZ63:AZ71))","v":0},{"$f":"IF(BB63=\"\",\"\",IF(H63-BB63<=0,1,H63-BB63))","v":1},{"$f":"CONCATENATE(BD63,BF63)","v":"14"},{"$f":"IF(K63=\"\",\"\",IF(K63-BC63<0,1,K63-BC63))","v":4}]
[null,2,"Factor_Interno","Tecnología","Problemas de espacio en el disco",null,"No recuperación de la base de datos en caso de desastres",{"$nulls":7},"Control Correctivo","Verificación de la generacion de la copia de seguridad","Continuo","Afecta la Probabilidad","Si",15,"Si",5,"Si",15,"No",0,"Si",15,"Si",10,"Si",{"$f":"IF(AE64=\"Si\",30,0)","v":30},90,"Disminuye la Probabilidad en 2",2,{"$nulls":7},"Disponer de recursos tecnológicos suficientes","Mejorar administración del espacio dispinible en medios de almacenamiento","Area de Servidores y Servicios de Internet","2015-12-01","Indefinido","Bitacora de verificación de espacio disponible",null,{"$f":"IF(R64=\"Afecta la Probabilidad\",AW64-(AW64-AI64),\"No aplica\")","v":2},null,"No aplica",{"$f":"IF([2]Matriz!R65=\"Afecta el Impacto\",CONCATENATE(AW64,AZ64),CONCATENATE(AX64,AY64))","v":"2"}]
[null,3,"Factor_Interno","Tecnología","Sectores del disco duro dañado ",null,"Pérdida de confianza por parte de la Comunidad Universitaria",{"$nulls":7},"Control Correctivo","Validación de la importación de la copia de seguridad en el ambiente de pruebas","Continuo","Afecta la Probabilidad","Si",15,"Si",5,"Si",15,"No",0,"Si",15,"Si",10,"Si",{"$f":"IF(AE65=\"Si\",30,0)","v":30},90,"Disminuye la Probabilidad en 2",2,{"$nulls":14},2,null,"No aplica",{"$f":"IF([2]Matriz!R66=\"Afecta el Impacto\",CONCATENATE(AW65,AZ65),CONCATENATE(AX65,AY65))","v":"2"}]
[null,4,"Factor_Externo","Tecnológicos","Fallas en el fluido eléctrico durante la generación de la copia",null,"Ambiente de pruebas no disponible",{"$nulls":12},0,null,0,null,0,null,0,null,0,null,0,null,{"$f":"IF(AE66=\"Si\",30,0)","v":0},0,"",0,{"$nulls":14},"No aplica",null,"No aplica",{"$f":"IF([2]Matriz!R67=\"Afecta el Impacto\",CONCATENATE(AW66,AZ66),CONCATENATE(AX66,AY66))","v":"No aplica"}]
[null,5,{"$nulls":17},0,null,0,null,0,null,0,null,0,null,0,null,{"$f":"IF(AE67=\"Si\",30,0)","v":0},0,"",0,{"$nulls":14},"No aplica",null,"No aplica",{"$f":"IF([2]Matriz!R68=\"Afecta el Impacto\",CONCATENATE(AW67,AZ67),CONCATENATE(AX67,AY67))","v":"No aplica"}]
[null,6,{"$nulls":17},0,null,0,null,0,null,0,null,0,null,0,null,0,0,"",0,{"$nulls":14},"No aplica",null,"No aplica",{"$f":"IF([2]Matriz!R69=\"Afecta el Impacto\",CONCATENATE(AW68,AZ68),CONCATENATE(AX68,AY68))","v":"No aplica"}]
[null,7,{"$nulls":17},0,null,0,null,0,null,0,null,0,null,0,null,0,0,"",0,{"$nulls":14},"No aplica",null,"No aplica",{"$f":"IF([2]Matriz!R70=\"Afecta el Impacto\",CONCATENATE(AW69,AZ69),CONCATENATE(AX69,AY69))","v":"No aplica"}]
[null,8,{"$nulls":17},0,null,0,null,0,null,0,null,0,null,0,null,0,0,"",0,{"$nulls":14},"No aplica",null,"No aplica",{"$f":"IF([2]Matriz!R71=\"Afecta el Impacto\",CONCATENATE(AW70,AZ70),CONCATENATE(AX70,AY70))","v":"No aplica"}]
[null,9,{"$nulls":17},0,null,0,null,0,null,0,null,0,null,0,null,0,0,"",0,{"$nulls":14},"No aplica",null,"No aplica",{"$f":"IF([2]Matriz!R72=\"Afecta el Impacto\",CONCATENATE(AW71,AZ71),CONCATENATE(AX71,AY71))","v":"No aplica"}]
["R8",1,"Factor_Interno","Tecnología","Aplicaciones mal configuradas","Abusos de privilegios de acceso","Alterar información",2,{"$f":"IF(H72=5,\"Mas de una vez al año\",IF(H72=4,\"Al menos una vez en el ultimo año\",IF(H72=3,\"Al menos una vez en los ultimos 2 años\",IF(H72=2,\"Al menos una vez en los ultimos 5 años\",\"No se ha presentado en los ultimos 5 años\"))))","v":"Al menos una vez en los ultimos 5 años"},{"$f":"CONCATENATE(H$72,K$72)","v":"25"},5,{"$f":"IF(K72=5,\"Catastrófico\",IF(K72=4,\"Mayor\",IF(K72=3,\"Moderado\",IF(K72=2,\"Menos\",IF(K72=1,\"Insignificante\",\"Digite Valor entre 1 y 5\")))))","v":"Catastrófico"},{"$f":"IF(L72=\"Digite Valor entre 1 y 5\",\"\",IF(COUNTIF(CE$10:CE$17,CONCATENATE(H72,K72)),CE$9,IF(COUNTIF(CF$10:CF$17,CONCATENATE(H72,K72)),CF$9,IF(COUNTIF(CG$10:CG$13,CONCATENATE(H72,K72)),CG$9,CH$9))))","v":"Zona de Riesgo Extrema"},{"$f":"IF(M72=CE$9,\"E\",IF(M72=CF$9,\"A\",IF(M72=CG$9,\"M\",IF(M72=CH$9,\"B\",\"\"))))","v":"E"},"Control Preventivo","Acceso restingido a las instacias de producción por herramientas de Administración de base de datos","Continuo","Afecta la Probabilidad","No",0,"Si",5,"Si",15,"No",0,"Si",15,"Si",10,"Si",30,75,{"$f":"IF(R72=\"\",\"\",IF(R72=\"Afecta la Probabilidad\",IF(AND(AG72>=0,AG72<=50),\"No disminuye la Probabilidad\",IF(AND(AG72>50,AG72<=75),\"Disminuye la Probabilidad en 1\",IF(AND(AG72>75,AG72<=100),\"Disminuye la Probabilidad en 2\",\"\"))),IF(AND(AG72>=0,AG72<=50),\"No disminuye el Impacto\",IF(AND(AG72>50,AG72<=75),\"Disminuye el Impacto en 1\",IF(AND(AG72>75,AG72<=100),\"Disminuye el Impacto en 2\",\"\")))))","v":"Disminuye la Probabilidad en 1"},1,{"$f":"BD72","v":1},{"$f":"IF(AJ72=5,\"Mas de una vez al año\",IF(AJ72=4,\"Al menos una vez en el ultimo año\",IF(AJ72=3,\"Al menos una vez en los ultimos 2 años\",IF(AJ72=2,\"Al menos una vez en los ultimos 5 años\",\"No se ha presentado en los ultimos 5 años\"))))","v":"No se ha presentado en los ultimos 5 años"},{"$f":"BF72","v":5},{"$f":"IF(AL72=5,\"Catastrófico - Tendría desastrosas consecuencias o efectos sobre la institución\",IF(AL72=4,\"Mayor - Tendría altas consecuencias o efectos sobre la institución\",IF(AL72=3,\"Moderado - Tendría medianas consecuencias o efectos sobre la institución\",IF(AL72=2,\"Menos - Tendría bajo impacto o efecto sobre la institución\",IF(AL72=1,\"Insignificante - tendría consecuencias o efectos mínimos en la institución\",\"Digite Valor entre 1 y 5\")))))","v":"Catastrófico - Tendría desastrosas consecuencias o efectos sobre la institución"},{"$f":"CONCATENATE(AJ72,AL72)","v":"15"},{"$f":"IF(COUNTIF($CE$10:$CE$17,AN72),$CE$9,IF(COUNTIF($CF$10:$CF$17,AN72),$CF$9,IF(COUNTIF($CG$10:$CG$13,AN72),$CG$9,IF(COUNTIF($CH$10:$CH$14,AN72),$CH$9,\"\"))))","v":"Zona de Riesgo Alta"},{"$f":"IF(AO72=$CE$9,\"E\",IF(AO72=$CF$9,\"A\",IF(AO72=$CG$9,\"M\",IF(AO72=$CH$9,\"B\",\"\"))))","v":"A"},"Activar auditorias propias de las aplicaciones","Se deben generar los instructivos del control","DBA's","2014-06-01","Indefinido",null,{"$f":"H72","v":2},1,{"$f":"K72","v":5},"No aplica",{"$f":"IF([2]Matriz!R73=\"Afecta el Impacto\",CONCATENATE(AW72,AZ72),CONCATENATE(AX72,AY72))","v":"15"},{"$f":"IF(R72=\"\",\"\",SUMIF(R72:R80,\"Afecta la Probabilidad\",AX72:AX80))","v":3},{"$f":"IF(R72=\"\",\"\",SUMIF(R72:R80,\"Afecta el Impacto\",AZ72:AZ80))","v":0},{"$f":"IF(BB72=\"\",\"\",IF(H72-BB72<=0,1,H72-BB72))","v":1},{"$f":"CONCATENATE(BD72,BF72)","v":"15"},{"$f":"IF(K72=\"\",\"\",IF(K72-BC72<0,1,K72-BC72))","v":5}]
[null,2,"Factor_del_Proceso","Interacciones con otros procesos","Falta de mantenimiento de usuarios",null,"Borrar información",{"$nulls":7},"Control Preventivo","Control de acceso por filtrados de IP's","Continuo","Afecta la Probabilidad","No",{"$f":"IF(S73=\"Si\",15,0)","v":0},"Si",{"$f":"IF(U73=\"Si\",5,0)","v":5},"Si",{"$f":"IF(W73=\"Si\",15,0)","v":15},"No",{"$f":"IF(Y73=\"Si\",10,0)","v":0},"Si",{"$f":"IF(AA73=\"Si\",15,0)","v":15},"Si",{"$f":"IF(AC73=\"Si\",10,0)","v":10},"Si",30,75,"Disminuye la Probabilidad en 1",1,{"$nulls":8},"Se deben generar los instructivos del control","Área servicios de Internet","2014-06-01","Indefinido","Log de acceso generados por el FIREWALL",null,1,null,{"$f":"IF(R73=\"Afecta el Impacto\",AY73-(AY73-AI73),\"No aplica\")","v":"No aplica"},{"$f":"IF([2]Matriz!R74=\"Afecta el Impacto\",CONCATENATE(AW73,AZ73),CONCATENATE(AX73,AY73))","v":"1"}]
[null,3,"Factor_del_Proceso","Interacciones con otros procesos","Falta en la revision de asignación de roles",null,"Acceder a información confidencial",{"$nulls":7},"Control Preventivo","Registro de accesos (Usuarios, IP)","Continuo","Afecta la Probabilidad","No",0,"Si",5,"Si",15,"No",0,"Si",15,"Si",10,"Si",30,75,"Disminuye la Probabilidad en 1",1,{"$nulls":8},"Se deben generar los instructivos del control","DBA's","2014-06-01","Indefinido","Registros en la base de datos de los accesos realizados por los usuarios",null,1,null,"No aplica",{"$f":"IF([2]Matriz!R75=\"Afecta el Impacto\",CONCATENATE(AW74,AZ74),CONCATENATE(AX74,AY74))","v":"1"}]
[null,4,{"$nulls":4},"Alterar la configuración de la base de datos",{"$nulls":12},0,null,0,null,0,null,0,null,0,null,0,null,0,0,"",0,{"$nulls":7},"Una vez adquiridos los paquetes de auditoria de Oracle, configurarlos y activarlos para todas las Bases de Datos","Adquirir paquetes de auditorias de bases de datos de Oracle","Jefatura Div. Tic y Vicerrectoría Administrativa","2016-01-01","2016-07-31","Sollcitud de Compra, CDP, RDP",null,"No aplica",null,"No aplica",{"$f":"IF([2]Matriz!R76=\"Afecta el Impacto\",CONCATENATE(AW75,AZ75),CONCATENATE(AX75,AY75))","v":"No aplica"}]
[null,5,{"$nulls":4},"Otorgar permisos no permitidos",{"$nulls":12},0,null,0,null,0,null,0,null,0,null,0,null,0,0,"",0,{"$nulls":8},"Concluidas las actualizaciones Finanzas, Recursos Físicos y Recursos Humanos, cerrar accesos a bases de datos de producción de usuarios con privilegios de administradores","DBA's","2016-03-01","2016-03-31","Scripts, Triggers, Registros en Bases de Datos",null,"No aplica",null,"No aplica",{"$f":"IF([2]Matriz!R77=\"Afecta el Impacto\",CONCATENATE(AW76,AZ76),CONCATENATE(AX76,AY76))","v":"No aplica"}]
[null,6,{"$nulls":17},0,null,0,null,0,null,0,null,0,null,0,null,0,0,"",0,{"$nulls":7},"Se recomienda crear una nueva area en la División de Tecnologías denominada Area de Seguridad de la Información","Auditorias de Seguridad de la Información","Area de Seguridad de la Información","2016-03-01","2016-12-31","Documento de creación del Area de Seguridad de la Información",null,"No aplica",null,"No aplica",{"$f":"IF([2]Matriz!R78=\"Afecta el Impacto\",CONCATENATE(AW77,AZ77),CONCATENATE(AX77,AY77))","v":"No aplica"}]
[null,7,{"$nulls":17},0,null,0,null,0,null,0,null,0,null,0,null,0,0,"",0,{"$nulls":14},"No aplica",null,"No aplica",{"$f":"IF([2]Matriz!R79=\"Afecta el Impacto\",CONCATENATE(AW78,AZ78),CONCATENATE(AX78,AY78))","v":"No aplica"}]
[null,8,{"$nulls":17},0,null,0,null,0,null,0,null,0,null,0,null,0,0,"",0,{"$nulls":14},"No aplica",null,"No aplica",{"$f":"IF([2]Matriz!R80=\"Afecta el Impacto\",CONCATENATE(AW79,AZ79),CONCATENATE(AX79,AY79))","v":"No aplica"}]
[null,9,{"$nulls":17},0,null,0,null,0,null,0,null,0,null,0,null,0,0,"",0,{"$nulls":14},"No aplica",null,"No aplica",{"$f":"IF([2]Matriz!R81=\"Afecta el Impacto\",CONCATENATE(AW80,AZ80),CONCATENATE(AX80,AY80))","v":{"$error":"#REF!"}}]
["R9",1,"Factor_Interno","Procesos","Personal insuficiente","Inadecuada instalación y/o activación del punto de red","Demora en la instalación y/o activación",4,{"$f":"IF(H81=5,\"Mas de una vez al año\",IF(H81=4,\"Al menos una vez en el ultimo año\",IF(H81=3,\"Al menos una vez en los ultimos 2 años\",IF(H81=2,\"Al menos una vez en los ultimos 5 años\",\"No se ha presentado en los ultimos 5 años\"))))","v":"Al menos una vez en el ultimo año"},{"$f":"CONCATENATE(H$81,K$81)","v":"44"},4,{"$f":"IF(K81=5,\"Catastrófico\",IF(K81=4,\"Mayor\",IF(K81=3,\"Moderado\",IF(K81=2,\"Menos\",IF(K81=1,\"Insignificante\",\"Digite Valor entre 1 y 5\")))))","v":"Mayor"},{"$f":"IF(L81=\"Digite Valor entre 1 y 5\",\"\",IF(COUNTIF(CE$10:CE$17,CONCATENATE(H81,K81)),CE$9,IF(COUNTIF(CF$10:CF$17,CONCATENATE(H81,K81)),CF$9,IF(COUNTIF(CG$10:CG$13,CONCATENATE(H81,K81)),CG$9,CH$9))))","v":"Zona de Riesgo Extrema"},{"$f":"IF(M81=CE$9,\"E\",IF(M81=CF$9,\"A\",IF(M81=CG$9,\"M\",IF(M81=CH$9,\"B\",\"\"))))","v":"E"},"Control Detectivo","HELPDESK","Mensual","Afecta el Impacto","Si",15,"Si",5,"No",0,"Si",10,"Si",15,"Si",10,"No",0,55,"Disminuye el Impacto en 1",1,{"$f":"BD81","v":3},{"$f":"IF(AJ81=5,\"Mas de una vez al año\",IF(AJ81=4,\"Al menos una vez en el ultimo año\",IF(AJ81=3,\"Al menos una vez en los ultimos 2 años\",IF(AJ81=2,\"Al menos una vez en los ultimos 5 años\",\"No se ha presentado en los ultimos 5 años\"))))","v":"Al menos una vez en los ultimos 2 años"},{"$f":"BF81","v":3},{"$f":"IF(AL81=5,\"Catastrófico - Tendría desastrosas consecuencias o efectos sobre la institución\",IF(AL81=4,\"Mayor - Tendría altas consecuencias o efectos sobre la institución\",IF(AL81=3,\"Moderado - Tendría medianas consecuencias o efectos sobre la institución\",IF(AL81=2,\"Menos - Tendría bajo impacto o efecto sobre la institución\",IF(AL81=1,\"Insignificante - tendría consecuencias o efectos mínimos en la institución\",\"Digite Valor entre 1 y 5\")))))","v":"Moderado - Tendría medianas consecuencias o efectos sobre la institución"},{"$f":"CONCATENATE(AJ81,AL81)","v":"33"},{"$f":"IF(COUNTIF($CE$10:$CE$17,AN81),$CE$9,IF(COUNTIF($CF$10:$CF$17,AN81),$CF$9,IF(COUNTIF($CG$10:$CG$13,AN81),$CG$9,IF(COUNTIF($CH$10:$CH$14,AN81),$CH$9,\"\"))))","v":"Zona de Riesgo Alta"},{"$f":"IF(AO81=$CE$9,\"E\",IF(AO81=$CF$9,\"A\",IF(AO81=$CG$9,\"M\",IF(AO81=$CH$9,\"B\",\"\"))))","v":"A"},"No son efectivos","Realizar mayor gestión ante Vicerrectoría administrativa para la asignacion de recursos","Jefatura de la Division y Coordinador de area","2015-11-26","2016-07-26","Estadisticas de Help desk",{"$f":"H81","v":4},{"$f":"IF(R81=\"Afecta la Probabilidad\",AW81-(AW81-AI81),\"No aplica\")","v":"No aplica"},{"$f":"K81","v":4},1,{"$f":"IF([3]Matriz!R82=\"Afecta el Impacto\",CONCATENATE(AW81,AZ81),CONCATENATE(AX81,AY81))","v":{"$error":"#REF!"}},{"$f":"IF(R81=\"\",\"\",SUMIF(R81:R89,\"Afecta la Probabilidad\",AX81:AX89))","v":1},{"$f":"IF(R81=\"\",\"\",SUMIF(R81:R89,\"Afecta el Impacto\",AZ81:AZ89))","v":1},{"$f":"IF(BB81=\"\",\"\",IF(H81-BB81<=0,1,H81-BB81))","v":3},{"$f":"CONCATENATE(BD81,BF81)","v":"33"},{"$f":"IF(K81=\"\",\"\",IF(K81-BC81<0,1,K81-BC81))","v":3}]
[null,2,"Factor_Interno","Financieros","Materiales insuficientes",null,"Ausencia del servicios de red",{"$nulls":7},"Control Preventivo","SOLICITUDES DE COMPRA DE MATERIALES Y HERRAMIENTAS","Trimestral","Afecta la Probabilidad","Si",15,"Si",5,"No",0,"Si",10,"Si",15,"Si",10,"No",0,55,"Disminuye la Probabilidad en 1",1,{"$nulls":10},"2015-11-26","2016-07-26","Solicitudes de compra de materiales",null,{"$f":"IF(R82=\"Afecta la Probabilidad\",AW82-(AW82-AI82),\"No aplica\")","v":1},null,"No aplica",{"$f":"IF([3]Matriz!R83=\"Afecta el Impacto\",CONCATENATE(AW82,AZ82),CONCATENATE(AX82,AY82))","v":{"$error":"#REF!"}}]
[null,3,"Factor_Interno","Tecnología","Desgaste de herramientas",null,"Mal funcionamiento del punto de red",{"$nulls":12},0,null,0,null,0,null,0,null,0,null,0,null,0,{"$f":"T83+V83+X83+Z83+AB83+AD83+AF83","v":0},"",0,{"$nulls":14},"No aplica",null,"No aplica",{"$f":"IF([3]Matriz!R84=\"Afecta el Impacto\",CONCATENATE(AW83,AZ83),CONCATENATE(AX83,AY83))","v":{"$error":"#REF!"}}]
[null,4,null,null,"Personal no idóneo",null,"Insatisfacción del cliente",{"$nulls":12},0,null,0,null,0,null,0,null,0,null,0,null,0,0,"",0,{"$nulls":14},"No aplica",null,"No aplica"]
[null,5,{"$nulls":17},0,null,0,null,0,null,0,null,0,null,0,null,0,0,"",0,{"$nulls":14},"No aplica",null,"No aplica"]
[null,6,{"$nulls":17},0,null,0,null,0,null,0,null,0,null,0,null,0,0,"",0,{"$nulls":14},"No aplica",null,"No aplica"]
[null,7,{"$nulls":17},0,null,0,null,0,null,0,null,0,null,0,null,0,0,"",0,{"$nulls":14},"No aplica",null,"No aplica"]
[null,8,{"$nulls":17},0,null,0,null,0,null,0,null,0,null,0,null,0,0,{"$f":"IF(R88=\"\",\"\",IF(R88=\"Afecta la Probabilidad\",IF(AND(AG88>=0,AG88<=50),\"No disminuye la Probabilidad\",IF(AND(AG88>50,AG88<=75),\"Disminuye la Probabilidad en 1\",IF(AND(AG88>75,AG88<=100),\"Disminuye la Probabilidad en 2\",\"\"))),IF(AND(AG88>=0,AG88<=50),\"No disminuye el Impacto\",IF(AND(AG88>50,AG88<=75),\"Disminuye el Impacto en 1\",IF(AND(AG88>75,AG88<=100),\"Disminuye el Impacto en 2\",\"\")))))","v":""},0,{"$nulls":14},"No aplica",null,"No aplica"]
[null,9,{"$nulls":17},0,null,0,null,0,null,0,null,0,null,0,null,0,0,"",0,{"$nulls":14},"No aplica",null,"No aplica"]
["R10",1,"Factor_Interno","Tecnología","Falla fluido elétrico","Daño en elsistema operativo de los equipos de red","Afectación  de los  servicios Institucionales",3,{"$f":"IF(H90=5,\"Mas de una vez al año\",IF(H90=4,\"Al menos una vez en el ultimo año\",IF(H90=3,\"Al menos una vez en los ultimos 2 años\",IF(H90=2,\"Al menos una vez en los ultimos 5 años\",\"No se ha presentado en los ultimos 5 años\"))))","v":"Al menos una vez en los ultimos 2 años"},{"$f":"CONCATENATE(H$90,K$90)","v":"34"},4,{"$f":"IF(K90=5,\"Catastrófico\",IF(K90=4,\"Mayor\",IF(K90=3,\"Moderado\",IF(K90=2,\"Menos\",IF(K90=1,\"Insignificante\",\"Digite Valor entre 1 y 5\")))))","v":"Mayor"},{"$f":"IF(L90=\"Digite Valor entre 1 y 5\",\"\",IF(COUNTIF(CE$10:CE$17,CONCATENATE(H90,K90)),CE$9,IF(COUNTIF(CF$10:CF$17,CONCATENATE(H90,K90)),CF$9,IF(COUNTIF(CG$10:CG$13,CONCATENATE(H90,K90)),CG$9,CH$9))))","v":"Zona de Riesgo Extrema"},{"$f":"IF(M90=CE$9,\"E\",IF(M90=CF$9,\"A\",IF(M90=CG$9,\"M\",IF(M90=CH$9,\"B\",\"\"))))","v":"E"},"Control Preventivo",null,"A Solicitud","Afecta la Probabilidad","Si",15,"Si",5,"No",0,"Si",10,"Si",15,"Si",10,"Si",30,85,"Disminuye la Probabilidad en 2",2,{"$f":"BD90","v":1},{"$f":"IF(AJ90=5,\"Mas de una vez al año\",IF(AJ90=4,\"Al menos una vez en el ultimo año\",IF(AJ90=3,\"Al menos una vez en los ultimos 2 años\",IF(AJ90=2,\"Al menos una vez en los ultimos 5 años\",\"No se ha presentado en los ultimos 5 años\"))))","v":"No se ha presentado en los ultimos 5 años"},{"$f":"BF90","v":4},{"$f":"IF(AL90=5,\"Catastrófico - Tendría desastrosas consecuencias o efectos sobre la institución\",IF(AL90=4,\"Mayor - Tendría altas consecuencias o efectos sobre la institución\",IF(AL90=3,\"Moderado - Tendría medianas consecuencias o efectos sobre la institución\",IF(AL90=2,\"Menos - Tendría bajo impacto o efecto sobre la institución\",IF(AL90=1,\"Insignificante - tendría consecuencias o efectos mínimos en la institución\",\"Digite Valor entre 1 y 5\")))))","v":"Mayor - Tendría altas consecuencias o efectos sobre la institución"},{"$f":"CONCATENATE(AJ90,AL90)","v":"14"},{"$f":"IF(COUNTIF($CE$10:$CE$17,AN90),$CE$9,IF(COUNTIF($CF$10:$CF$17,AN90),$CF$9,IF(COUNTIF($CG$10:$CG$13,AN90),$CG$9,IF(COUNTIF($CH$10:$CH$14,AN90),$CH$9,\"\"))))","v":"Zona de Riesgo Alta"},{"$f":"IF(AO90=$CE$9,\"E\",IF(AO90=$CF$9,\"A\",IF(AO90=$CG$9,\"M\",IF(AO90=$CH$9,\"B\",\"\"))))","v":"A"},null,null,"Helpdesk","2015-11-26","2015-07-26",null,{"$f":"H90","v":3},2,{"$f":"K90","v":4},"No aplica",null,{"$f":"IF(R90=\"\",\"\",SUMIF(R90:R98,\"Afecta la Probabilidad\",AX90:AX98))","v":4},{"$f":"IF(R90=\"\",\"\",SUMIF(R90:R98,\"Afecta el Impacto\",AZ90:AZ98))","v":0},{"$f":"IF(BB90=\"\",\"\",IF(H90-BB90<=0,1,H90-BB90))","v":1},{"$f":"CONCATENATE(BD90,BF90)","v":"14"},{"$f":"IF(K90=\"\",\"\",IF(K90-BC90<0,1,K90-BC90))","v":4}]
[null,2,"Factor_Interno","Personal","Error humano",null,"Afectación de la calidad de los  servicios Institucionales",{"$nulls":7},"Control Preventivo"," Backup de IOS","Mensual","Afecta la Probabilidad","Si",15,"Si",5,"Si",15,"Si",10,"Si",15,"Si",10,"Si",30,100,{"$f":"IF(R91=\"\",\"\",IF(R91=\"Afecta la Probabilidad\",IF(AND(AG91>=0,AG91<=50),\"No disminuye la Probabilidad\",IF(AND(AG91>50,AG91<=75),\"Disminuye la Probabilidad en 1\",IF(AND(AG91>75,AG91<=100),\"Disminuye la Probabilidad en 2\",\"\"))),IF(AND(AG91>=0,AG91<=50),\"No disminuye el Impacto\",IF(AND(AG91>50,AG91<=75),\"Disminuye el Impacto en 1\",IF(AND(AG91>75,AG91<=100),\"Disminuye el Impacto en 2\",\"\")))))","v":"Disminuye la Probabilidad en 2"},2,{"$nulls":8},"Almacenamiento de imágenes","Personal administrativo ","2015-11-26","2015-07-26",null,null,2,null,"No aplica"]
[null,3,"Factor_Externo","Tecnológicos","Ataque informático",{"$nulls":14},0,null,0,null,0,null,0,null,0,null,0,null,0,0,{"$f":"IF(R92=\"\",\"\",IF(R92=\"Afecta la Probabilidad\",IF(AND(AG92>=0,AG92<=50),\"No disminuye la Probabilidad\",IF(AND(AG92>50,AG92<=75),\"Disminuye la Probabilidad en 1\",IF(AND(AG92>75,AG92<=100),\"Disminuye la Probabilidad en 2\",\"\"))),IF(AND(AG92>=0,AG92<=50),\"No disminuye el Impacto\",IF(AND(AG92>50,AG92<=75),\"Disminuye el Impacto en 1\",IF(AND(AG92>75,AG92<=100),\"Disminuye el Impacto en 2\",\"\")))))","v":""},0,{"$nulls":14},"No aplica",null,"No aplica"]
[null,4,{"$nulls":17},0,null,0,null,0,null,0,null,0,null,0,null,0,0,{"$f":"IF(R93=\"\",\"\",IF(R93=\"Afecta la Probabilidad\",IF(AND(AG93>=0,AG93<=50),\"No disminuye la Probabilidad\",IF(AND(AG93>50,AG93<=75),\"Disminuye la Probabilidad en 1\",IF(AND(AG93>75,AG93<=100),\"Disminuye la Probabilidad en 2\",\"\"))),IF(AND(AG93>=0,AG93<=50),\"No disminuye el Impacto\",IF(AND(AG93>50,AG93<=75),\"Disminuye el Impacto en 1\",IF(AND(AG93>75,AG93<=100),\"Disminuye el Impacto en 2\",\"\")))))","v":""},0,{"$nulls":14},"No aplica",null,"No aplica"]
[null,5,{"$nulls":17},0,null,0,null,0,null,0,null,0,null,0,null,0,0,{"$f":"IF(R94=\"\",\"\",IF(R94=\"Afecta la Probabilidad\",IF(AND(AG94>=0,AG94<=50),\"No disminuye la Probabilidad\",IF(AND(AG94>50,AG94<=75),\"Disminuye la Probabilidad en 1\",IF(AND(AG94>75,AG94<=100),\"Disminuye la Probabilidad en 2\",\"\"))),IF(AND(AG94>=0,AG94<=50),\"No disminuye el Impacto\",IF(AND(AG94>50,AG94<=75),\"Disminuye el Impacto en 1\",IF(AND(AG94>75,AG94<=100),\"Disminuye el Impacto en 2\",\"\")))))","v":""},0,{"$nulls":14},"No aplica",null,"No aplica"]
[null,6,{"$nulls":17},0,null,0,null,0,null,0,null,0,null,0,null,0,0,"",0,{"$nulls":14},"No aplica",null,"No aplica"]
[null,7,{"$nulls":17},0,null,0,null,0,null,0,null,0,null,0,null,0,0,"",0,{"$nulls":14},"No aplica",null,"No aplica"]
[null,8,{"$nulls":17},0,null,0,null,0,null,0,null,0,null,0,null,0,0,"",0,{"$nulls":14},"No aplica",null,"No aplica"]
[null,9,{"$nulls":17},0,null,0,null,0,null,0,null,0,null,0,null,0,0,"",0,{"$nulls":14},"No aplica",null,"No aplica"]
["R11",1,"Factor_Externo","Personal","Personal externo no idoneo o no competente","Inadecuado diseño de la solución de infraestructura ","insatisfacción del cliente",4,{"$f":"IF(H99=5,\"Mas de una vez al año\",IF(H99=4,\"Al menos una vez en el ultimo año\",IF(H99=3,\"Al menos una vez en los ultimos 2 años\",IF(H99=2,\"Al menos una vez en los ultimos 5 años\",\"No se ha presentado en los ultimos 5 años\"))))","v":"Al menos una vez en el ultimo año"},{"$f":"CONCATENATE(H$99,K$99)","v":"44"},4,{"$f":"IF(K99=5,\"Catastrófico\",IF(K99=4,\"Mayor\",IF(K99=3,\"Moderado\",IF(K99=2,\"Menos\",IF(K99=1,\"Insignificante\",\"Digite Valor entre 1 y 5\")))))","v":"Mayor"},{"$f":"IF(L99=\"Digite Valor entre 1 y 5\",\"\",IF(COUNTIF(CE$10:CE$17,CONCATENATE(H99,K99)),CE$9,IF(COUNTIF(CF$10:CF$17,CONCATENATE(H99,K99)),CF$9,IF(COUNTIF(CG$10:CG$13,CONCATENATE(H99,K99)),CG$9,CH$9))))","v":"Zona de Riesgo Extrema"},{"$f":"IF(M99=CE$9,\"E\",IF(M99=CF$9,\"A\",IF(M99=CG$9,\"M\",IF(M99=CH$9,\"B\",\"\"))))","v":"E"},"Control Preventivo"," lista de chequeo","A Solicitud","Afecta la Probabilidad","Si",15,"Si",5,"No",0,"Si",10,"Si",15,"Si",10,"No",0,55,{"$f":"IF(R99=\"\",\"\",IF(R99=\"Afecta la Probabilidad\",IF(AND(AG99>=0,AG99<=50),\"No disminuye la Probabilidad\",IF(AND(AG99>50,AG99<=75),\"Disminuye la Probabilidad en 1\",IF(AND(AG99>75,AG99<=100),\"Disminuye la Probabilidad en 2\",\"\"))),IF(AND(AG99>=0,AG99<=50),\"No disminuye el Impacto\",IF(AND(AG99>50,AG99<=75),\"Disminuye el Impacto en 1\",IF(AND(AG99>75,AG99<=100),\"Disminuye el Impacto en 2\",\"\")))))","v":"Disminuye la Probabilidad en 1"},1,{"$f":"BD99","v":2},{"$f":"IF(AJ99=5,\"Mas de una vez al año\",IF(AJ99=4,\"Al menos una vez en el ultimo año\",IF(AJ99=3,\"Al menos una vez en los ultimos 2 años\",IF(AJ99=2,\"Al menos una vez en los ultimos 5 años\",\"No se ha presentado en los ultimos 5 años\"))))","v":"Al menos una vez en los ultimos 5 años"},{"$f":"BF99","v":4},{"$f":"IF(AL99=5,\"Catastrófico - Tendría desastrosas consecuencias o efectos sobre la institución\",IF(AL99=4,\"Mayor - Tendría altas consecuencias o efectos sobre la institución\",IF(AL99=3,\"Moderado - Tendría medianas consecuencias o efectos sobre la institución\",IF(AL99=2,\"Menos - Tendría bajo impacto o efecto sobre la institución\",IF(AL99=1,\"Insignificante - tendría consecuencias o efectos mínimos en la institución\",\"Digite Valor entre 1 y 5\")))))","v":"Mayor - Tendría altas consecuencias o efectos sobre la institución"},{"$f":"CONCATENATE(AJ99,AL99)","v":"24"},{"$f":"IF(COUNTIF($CE$10:$CE$17,AN99),$CE$9,IF(COUNTIF($CF$10:$CF$17,AN99),$CF$9,IF(COUNTIF($CG$10:$CG$13,AN99),$CG$9,IF(COUNTIF($CH$10:$CH$14,AN99),$CH$9,\"\"))))","v":"Zona de Riesgo Alta"},{"$f":"IF(AO99=$CE$9,\"E\",IF(AO99=$CF$9,\"A\",IF(AO99=$CG$9,\"M\",IF(AO99=$CH$9,\"B\",\"\"))))","v":"A"},"actualizacion permanente a las lista de chequeo","Mejoramiento listas de chequeo","coordinador del área, personal del proyecto","2015-11-26","2016-11-26","listas de chequeo",{"$f":"H99","v":4},1,{"$f":"K99","v":4},"No aplica",null,{"$f":"IF(R99=\"\",\"\",SUMIF(R99:R107,\"Afecta la Probabilidad\",AX99:AX107))","v":2},{"$f":"IF(R99=\"\",\"\",SUMIF(R99:R107,\"Afecta el Impacto\",AZ99:AZ107))","v":0},{"$f":"IF(BB99=\"\",\"\",IF(H99-BB99<=0,1,H99-BB99))","v":2},{"$f":"CONCATENATE(BD99,BF99)","v":"24"},{"$f":"IF(K99=\"\",\"\",IF(K99-BC99<0,1,K99-BC99))","v":4}]
[null,2,"Factor_Externo","Personal","Poco disponibilidad del personal",null,"Retardos en el proyecto",{"$nulls":7},"Control Preventivo","Analisis de solicitud e interaccion con el cliente","A Solicitud","Afecta la Probabilidad","Si",15,"Si",5,"No",0,"Si",10,"Si",15,"Si",10,"No",0,55,{"$f":"IF(R100=\"\",\"\",IF(R100=\"Afecta la Probabilidad\",IF(AND(AG100>=0,AG100<=50),\"No disminuye la Probabilidad\",IF(AND(AG100>50,AG100<=75),\"Disminuye la Probabilidad en 1\",IF(AND(AG100>75,AG100<=100),\"Disminuye la Probabilidad en 2\",\"\"))),IF(AND(AG100>=0,AG100<=50),\"No disminuye el Impacto\",IF(AND(AG100>50,AG100<=75),\"Disminuye el Impacto en 1\",IF(AND(AG100>75,AG100<=100),\"Disminuye el Impacto en 2\",\"\")))))","v":"Disminuye la Probabilidad en 1"},1,{"$nulls":8},"Mejoramiento del formato de control de interaccion con el cliente","coordinador del área, personal del proyecto","2015-11-26","2016-11-26","formato de interaccion diligenciado",null,1,null,"No aplica"]
[null,3,"Factor_Externo","Tecnología","Requerimientos para la solución mal planteados",null,"sobrecostos en el rediseño de la solucion e implementación",{"$nulls":12},0,null,0,null,0,null,0,null,0,null,0,null,0,0,{"$f":"IF(R101=\"\",\"\",IF(R101=\"Afecta la Probabilidad\",IF(AND(AG101>=0,AG101<=50),\"No disminuye la Probabilidad\",IF(AND(AG101>50,AG101<=75),\"Disminuye la Probabilidad en 1\",IF(AND(AG101>75,AG101<=100),\"Disminuye la Probabilidad en 2\",\"\"))),IF(AND(AG101>=0,AG101<=50),\"No disminuye el Impacto\",IF(AND(AG101>50,AG101<=75),\"Disminuye el Impacto en 1\",IF(AND(AG101>75,AG101<=100),\"Disminuye el Impacto en 2\",\"\")))))","v":""},0,{"$nulls":12},"Registro en Help Desk",null,"No aplica",null,"No aplica"]
[null,4,null,null,"Carencia o insuficiencia de recursos desde la planeación ",{"$nulls":14},0,null,0,null,0,null,0,null,0,null,0,null,0,0,{"$f":"IF(R102=\"\",\"\",IF(R102=\"Afecta la Probabilidad\",IF(AND(AG102>=0,AG102<=50),\"No disminuye la Probabilidad\",IF(AND(AG102>50,AG102<=75),\"Disminuye la Probabilidad en 1\",IF(AND(AG102>75,AG102<=100),\"Disminuye la Probabilidad en 2\",\"\"))),IF(AND(AG102>=0,AG102<=50),\"No disminuye el Impacto\",IF(AND(AG102>50,AG102<=75),\"Disminuye el Impacto en 1\",IF(AND(AG102>75,AG102<=100),\"Disminuye el Impacto en 2\",\"\")))))","v":""},0,{"$nulls":14},"No aplica",null,"No aplica"]
[null,5,{"$nulls":17},0,null,0,null,0,null,0,null,0,null,0,null,0,0,"",0,{"$nulls":14},"No aplica",null,"No aplica"]
[null,6,{"$nulls":17},0,null,0,null,0,null,0,null,0,null,0,null,0,0,"",0,{"$nulls":14},"No aplica",null,"No aplica"]
[null,7,{"$nulls":17},0,null,0,null,0,null,0,null,0,null,0,null,0,0,"",0,{"$nulls":14},"No aplica",null,"No aplica"]
[null,8,{"$nulls":17},0,null,0,null,0,null,0,null,0,null,0,null,0,0,"",0,{"$nulls":14},"No aplica",null,"No aplica"]
[null,9,{"$nulls":17},0,null,0,null,0,null,0,null,0,null,0,null,0,0,"",0,{"$nulls":14},"No aplica",null,"No aplica"]
["R12",1,"Factor_Externo","Tecnológicos","Avance de la tecnología ","Desactualización del conocimiento del recurso humano","Afectación de los servicios Institucionales",4,{"$f":"IF(H108=5,\"Mas de una vez al año\",IF(H108=4,\"Al menos una vez en el ultimo año\",IF(H108=3,\"Al menos una vez en los ultimos 2 años\",IF(H108=2,\"Al menos una vez en los ultimos 5 años\",\"No se ha presentado en los ultimos 5 años\"))))","v":"Al menos una vez en el ultimo año"},{"$f":"CONCATENATE(H$108,K$108)","v":"44"},4,{"$f":"IF(K108=5,\"Catastrófico\",IF(K108=4,\"Mayor\",IF(K108=3,\"Moderado\",IF(K108=2,\"Menos\",IF(K108=1,\"Insignificante\",\"Digite Valor entre 1 y 5\")))))","v":"Mayor"},{"$f":"IF(L108=\"Digite Valor entre 1 y 5\",\"\",IF(COUNTIF(CE$10:CE$17,CONCATENATE(H108,K108)),CE$9,IF(COUNTIF(CF$10:CF$17,CONCATENATE(H108,K108)),CF$9,IF(COUNTIF(CG$10:CG$13,CONCATENATE(H108,K108)),CG$9,CH$9))))","v":"Zona de Riesgo Extrema"},{"$f":"IF(M108=CE$9,\"E\",IF(M108=CF$9,\"A\",IF(M108=CG$9,\"M\",IF(M108=CH$9,\"B\",\"\"))))","v":"E"},"Control Preventivo","Plan de capacitación del Area","Semestral","Afecta la Probabilidad","No",0,"Si",5,"No",0,"Si",10,"No",0,"No",0,"No",0,15,"No disminuye la Probabilidad",0,{"$f":"BD108","v":4},{"$f":"IF(AJ108=5,\"Mas de una vez al año\",IF(AJ108=4,\"Al menos una vez en el ultimo año\",IF(AJ108=3,\"Al menos una vez en los ultimos 2 años\",IF(AJ108=2,\"Al menos una vez en los ultimos 5 años\",\"No se ha presentado en los ultimos 5 años\"))))","v":"Al menos una vez en el ultimo año"},{"$f":"BF108","v":4},{"$f":"IF(AL108=5,\"Catastrófico - Tendría desastrosas consecuencias o efectos sobre la institución\",IF(AL108=4,\"Mayor - Tendría altas consecuencias o efectos sobre la institución\",IF(AL108=3,\"Moderado - Tendría medianas consecuencias o efectos sobre la institución\",IF(AL108=2,\"Menos - Tendría bajo impacto o efecto sobre la institución\",IF(AL108=1,\"Insignificante - tendría consecuencias o efectos mínimos en la institución\",\"Digite Valor entre 1 y 5\")))))","v":"Mayor - Tendría altas consecuencias o efectos sobre la institución"},{"$f":"CONCATENATE(AJ108,AL108)","v":"44"},{"$f":"IF(COUNTIF($CE$10:$CE$17,AN108),$CE$9,IF(COUNTIF($CF$10:$CF$17,AN108),$CF$9,IF(COUNTIF($CG$10:$CG$13,AN108),$CG$9,IF(COUNTIF($CH$10:$CH$14,AN108),$CH$9,\"\"))))","v":"Zona de Riesgo Extrema"},{"$f":"IF(AO108=$CE$9,\"E\",IF(AO108=$CF$9,\"A\",IF(AO108=$CG$9,\"M\",IF(AO108=$CH$9,\"B\",\"\"))))","v":"E"},"Actualizar el plan de capacitacion","Construir el plan de capacitación del Area","Jefatura de las TIC y Coordinador de Area","2015-11-26","2016-07-26","Capacitaciones realizadas",{"$f":"H108","v":4},0,{"$f":"K108","v":4},"No aplica",null,{"$f":"IF(R108=\"\",\"\",SUMIF(R108:R116,\"Afecta la Probabilidad\",AX108:AX116))","v":0},{"$f":"IF(R108=\"\",\"\",SUMIF(R108:R116,\"Afecta el Impacto\",AZ108:AZ116))","v":0},{"$f":"IF(BB108=\"\",\"\",IF(H108-BB108<=0,1,H108-BB108))","v":4},{"$f":"CONCATENATE(BD108,BF108)","v":"44"},{"$f":"IF(K108=\"\",\"\",IF(K108-BC108<0,1,K108-BC108))","v":4}]
[null,2,"Factor_Interno","Procesos","No regularidad en los planes de capactación",null,"Demora en los tiempos de configuración e instalación de dispositivos de red",{"$nulls":12},0,null,0,null,0,null,0,null,0,null,0,null,0,0,"",0,{"$nulls":14},"No aplica",null,"No aplica"]
[null,3,null,null,"Carencia de un monitoreo de posibilidades de capacitacion",{"$nulls":14},0,null,0,null,0,null,0,null,0,null,0,null,0,0,"",0,{"$nulls":14},"No aplica",null,"No aplica"]
[null,4,{"$nulls":17},0,null,0,null,0,null,0,null,0,null,0,null,0,0,"",0,{"$nulls":14},"No aplica",null,"No aplica"]
[null,5,{"$nulls":17},0,null,0,null,0,null,0,null,0,null,0,null,0,0,"",0,{"$nulls":14},"No aplica",null,"No aplica"]
[null,6,{"$nulls":17},0,null,0,null,0,null,0,null,0,null,0,null,0,0,"",0,{"$nulls":14},"No aplica",null,"No aplica"]
[null,7,{"$nulls":17},0,null,0,null,0,null,0,null,0,null,0,null,0,0,"",0,{"$nulls":14},"No aplica",null,"No aplica"]
[null,8,{"$nulls":17},0,null,0,null,0,null,0,null,0,null,0,null,0,0,"",0,{"$nulls":14},"No aplica",null,"No aplica"]
[null,9,{"$nulls":17},0,null,0,null,0,null,0,null,0,null,0,null,0,0,"",0,{"$nulls":14},"No aplica",null,"No aplica",{"$f":"IF([3]Matriz!R117=\"Afecta el Impacto\",CONCATENATE(AW116,AZ116),CONCATENATE(AX116,AY116))","v":{"$error":"#REF!"}}]
["R13",1,"Factor_Interno","Procesos","Ausencia del procedimiento de préstamo","Inadecuada administración de las llaves","Daños fisicos en equipos",4,{"$f":"IF(H117=5,\"Mas de una vez al año\",IF(H117=4,\"Al menos una vez en el ultimo año\",IF(H117=3,\"Al menos una vez en los ultimos 2 años\",IF(H117=2,\"Al menos una vez en los ultimos 5 años\",\"No se ha presentado en los ultimos 5 años\"))))","v":"Al menos una vez en el ultimo año"},{"$f":"CONCATENATE(H$117,K$117)","v":"44"},4,{"$f":"IF(K117=5,\"Catastrófico\",IF(K117=4,\"Mayor\",IF(K117=3,\"Moderado\",IF(K117=2,\"Menos\",IF(K117=1,\"Insignificante\",\"Digite Valor entre 1 y 5\")))))","v":"Mayor"},{"$f":"IF(L117=\"Digite Valor entre 1 y 5\",\"\",IF(COUNTIF(CE$10:CE$17,CONCATENATE(H117,K117)),CE$9,IF(COUNTIF(CF$10:CF$17,CONCATENATE(H117,K117)),CF$9,IF(COUNTIF(CG$10:CG$13,CONCATENATE(H117,K117)),CG$9,CH$9))))","v":"Zona de Riesgo Extrema"},{"$f":"IF(M117=CE$9,\"E\",IF(M117=CF$9,\"A\",IF(M117=CG$9,\"M\",IF(M117=CH$9,\"B\",\"\"))))","v":"E"},"Control Preventivo","Formatos de registro","A Solicitud","Afecta la Probabilidad","Si",15,"Si",5,"No",0,"Si",10,"No",0,"Si",10,"Si",30,70,"Disminuye la Probabilidad en 1",1,{"$f":"BD117","v":3},{"$f":"IF(AJ117=5,\"Mas de una vez al año\",IF(AJ117=4,\"Al menos una vez en el ultimo año\",IF(AJ117=3,\"Al menos una vez en los ultimos 2 años\",IF(AJ117=2,\"Al menos una vez en los ultimos 5 años\",\"No se ha presentado en los ultimos 5 años\"))))","v":"Al menos una vez en los ultimos 2 años"},{"$f":"BF117","v":4},{"$f":"IF(AL117=5,\"Catastrófico - Tendría desastrosas consecuencias o efectos sobre la institución\",IF(AL117=4,\"Mayor - Tendría altas consecuencias o efectos sobre la institución\",IF(AL117=3,\"Moderado - Tendría medianas consecuencias o efectos sobre la institución\",IF(AL117=2,\"Menos - Tendría bajo impacto o efecto sobre la institución\",IF(AL117=1,\"Insignificante - tendría consecuencias o efectos mínimos en la institución\",\"Digite Valor entre 1 y 5\")))))","v":"Mayor - Tendría altas consecuencias o efectos sobre la institución"},{"$f":"CONCATENATE(AJ117,AL117)","v":"34"},{"$f":"IF(COUNTIF($CE$10:$CE$17,AN117),$CE$9,IF(COUNTIF($CF$10:$CF$17,AN117),$CF$9,IF(COUNTIF($CG$10:$CG$13,AN117),$CG$9,IF(COUNTIF($CH$10:$CH$14,AN117),$CH$9,\"\"))))","v":"Zona de Riesgo Extrema"},{"$f":"IF(AO117=$CE$9,\"E\",IF(AO117=$CF$9,\"A\",IF(AO117=$CG$9,\"M\",IF(AO117=$CH$9,\"B\",\"\"))))","v":"E"},"Mejorar el proceso","Mejorar el registro de control de llaves","Coordinador del Area","2015-11-26","2016-07-25","Registro de prestamo",{"$f":"H117","v":4},1,{"$f":"K117","v":4},"No aplica",null,{"$f":"IF(R117=\"\",\"\",SUMIF(R117:R125,\"Afecta la Probabilidad\",AX117:AX125))","v":1},{"$f":"IF(R117=\"\",\"\",SUMIF(R117:R125,\"Afecta el Impacto\",AZ117:AZ125))","v":0},{"$f":"IF(BB117=\"\",\"\",IF(H117-BB117<=0,1,H117-BB117))","v":3},{"$f":"CONCATENATE(BD117,BF117)","v":"34"},{"$f":"IF(K117=\"\",\"\",IF(K117-BC117<0,1,K117-BC117))","v":4}]
[null,2,"Factor_Interno","Procesos","Falta de acompañamiento por personal autorizado",null,"Control sobre el acceso",{"$nulls":7},"Control Preventivo","Protocolo de administracion de llaves","A Solicitud","Afecta la Probabilidad","No",0,"Si",5,"No",0,"Si",10,"No",0,"No",0,"No",0,15,{"$f":"IF(R118=\"\",\"\",IF(R118=\"Afecta la Probabilidad\",IF(AND(AG118>=0,AG118<=50),\"No disminuye la Probabilidad\",IF(AND(AG118>50,AG118<=75),\"Disminuye la Probabilidad en 1\",IF(AND(AG118>75,AG118<=100),\"Disminuye la Probabilidad en 2\",\"\"))),IF(AND(AG118>=0,AG118<=50),\"No disminuye el Impacto\",IF(AND(AG118>50,AG118<=75),\"Disminuye el Impacto en 1\",IF(AND(AG118>75,AG118<=100),\"Disminuye el Impacto en 2\",\"\")))))","v":"No disminuye la Probabilidad"},0,{"$nulls":8},"Construir el protocolo","Coordinador del Area","2015-11-26","2016-07-25","Documento de protocolo",null,0,null,"No aplica"]
[null,3,"Factor_Interno","Procesos","Identificación de las llaves",null,"Retardo en el tiempo de acceso",{"$nulls":12},0,null,0,null,0,null,0,null,0,null,0,null,0,0,{"$f":"IF(R119=\"\",\"\",IF(R119=\"Afecta la Probabilidad\",IF(AND(AG119>=0,AG119<=50),\"No disminuye la Probabilidad\",IF(AND(AG119>50,AG119<=75),\"Disminuye la Probabilidad en 1\",IF(AND(AG119>75,AG119<=100),\"Disminuye la Probabilidad en 2\",\"\"))),IF(AND(AG119>=0,AG119<=50),\"No disminuye el Impacto\",IF(AND(AG119>50,AG119<=75),\"Disminuye el Impacto en 1\",IF(AND(AG119>75,AG119<=100),\"Disminuye el Impacto en 2\",\"\")))))","v":""},{"$f":"IF(AG119<=50,0,IF(AND(AG119>50,AG119<=75),1,IF(AND(AG119>75,AG119<=100),2,\"\")))","v":0},{"$nulls":14},"No aplica",null,"No aplica"]
[null,4,null,null,"Racks sin llaves",null,"Pérdida de los servicios Institucionales",{"$nulls":12},0,null,0,null,0,null,0,null,0,null,0,null,0,0,{"$f":"IF(R120=\"\",\"\",IF(R120=\"Afecta la Probabilidad\",IF(AND(AG120>=0,AG120<=50),\"No disminuye la Probabilidad\",IF(AND(AG120>50,AG120<=75),\"Disminuye la Probabilidad en 1\",IF(AND(AG120>75,AG120<=100),\"Disminuye la Probabilidad en 2\",\"\"))),IF(AND(AG120>=0,AG120<=50),\"No disminuye el Impacto\",IF(AND(AG120>50,AG120<=75),\"Disminuye el Impacto en 1\",IF(AND(AG120>75,AG120<=100),\"Disminuye el Impacto en 2\",\"\")))))","v":""},0,{"$nulls":14},"No aplica",null,"No aplica"]
[null,5,{"$nulls":4},"Robo de los equipos",{"$nulls":12},0,null,0,null,0,null,0,null,0,null,0,null,0,0,{"$f":"IF(R121=\"\",\"\",IF(R121=\"Afecta la Probabilidad\",IF(AND(AG121>=0,AG121<=50),\"No disminuye la Probabilidad\",IF(AND(AG121>50,AG121<=75),\"Disminuye la Probabilidad en 1\",IF(AND(AG121>75,AG121<=100),\"Disminuye la Probabilidad en 2\",\"\"))),IF(AND(AG121>=0,AG121<=50),\"No disminuye el Impacto\",IF(AND(AG121>50,AG121<=75),\"Disminuye el Impacto en 1\",IF(AND(AG121>75,AG121<=100),\"Disminuye el Impacto en 2\",\"\")))))","v":""},0,{"$nulls":14},"No aplica",null,"No aplica"]
[null,6,{"$nulls":17},0,null,0,null,0,null,0,null,0,null,0,null,0,0,"",0,{"$nulls":14},"No aplica",null,"No aplica"]
[null,7,{"$nulls":17},0,null,0,null,0,null,0,null,0,null,0,null,0,0,"",0,{"$nulls":14},"No aplica",null,"No aplica"]
[null,8,{"$nulls":17},0,null,0,null,0,null,0,null,0,null,0,null,0,0,"",0,{"$nulls":14},"No aplica",null,"No aplica"]
[null,9,{"$nulls":17},0,null,0,null,0,null,0,null,0,null,0,null,0,0,"",0,{"$nulls":14},"No aplica",null,"No aplica",{"$f":"IF([3]Matriz!R126=\"Afecta el Impacto\",CONCATENATE(AW125,AZ125),CONCATENATE(AX125,AY125))","v":{"$error":"#REF!"}}]
["R14",1,"Factor_Interno","Tecnología","Falta de capacitación interna y externa al personal de soporte técnico","No poder dar soporte con eficiencia y eficacia","Insatisfacción del usuario",5,{"$f":"IF(H126=5,\"Mas de una vez al año\",IF(H126=4,\"Al menos una vez en el ultimo año\",IF(H126=3,\"Al menos una vez en los ultimos 2 años\",IF(H126=2,\"Al menos una vez en los ultimos 5 años\",\"No se ha presentado en los ultimos 5 años\"))))","v":"Mas de una vez al año"},{"$f":"CONCATENATE(H$126,K$126)","v":"54"},4,{"$f":"IF(K126=5,\"Catastrófico\",IF(K126=4,\"Mayor\",IF(K126=3,\"Moderado\",IF(K126=2,\"Menos\",IF(K126=1,\"Insignificante\",\"Digite Valor entre 1 y 5\")))))","v":"Mayor"},{"$f":"IF(L126=\"Digite Valor entre 1 y 5\",\"\",IF(COUNTIF(CE$10:CE$17,CONCATENATE(H126,K126)),CE$9,IF(COUNTIF(CF$10:CF$17,CONCATENATE(H126,K126)),CF$9,IF(COUNTIF(CG$10:CG$13,CONCATENATE(H126,K126)),CG$9,CH$9))))","v":"Zona de Riesgo Extrema"},{"$f":"IF(M126=CE$9,\"E\",IF(M126=CF$9,\"A\",IF(M126=CG$9,\"M\",IF(M126=CH$9,\"B\",\"\"))))","v":"E"},"Control Correctivo","Plan de capacitación","Continuo","Afecta el Impacto","No",0,"Si",5,"No",0,"No",0,"Si",15,"No",0,"No",{"$f":"IF(AE126=\"Si\",30,0)","v":0},20,{"$f":"IF(R126=\"\",\"\",IF(R126=\"Afecta la Probabilidad\",IF(AND(AG126>=0,AG126<=50),\"No disminuye la Probabilidad\",IF(AND(AG126>50,AG126<=75),\"Disminuye la Probabilidad en 1\",IF(AND(AG126>75,AG126<=100),\"Disminuye la Probabilidad en 2\",\"\"))),IF(AND(AG126>=0,AG126<=50),\"No disminuye el Impacto\",IF(AND(AG126>50,AG126<=75),\"Disminuye el Impacto en 1\",IF(AND(AG126>75,AG126<=100),\"Disminuye el Impacto en 2\",\"\")))))","v":"No disminuye el Impacto"},{"$f":"IF(AG126<=50,0,IF(AND(AG126>50,AG126<=75),1,IF(AND(AG126>75,AG126<=100),2,\"\")))","v":0},{"$f":"BD126","v":5},{"$f":"IF(AJ126=5,\"Mas de una vez al año\",IF(AJ126=4,\"Al menos una vez en el ultimo año\",IF(AJ126=3,\"Al menos una vez en los ultimos 2 años\",IF(AJ126=2,\"Al menos una vez en los ultimos 5 años\",\"No se ha presentado en los ultimos 5 años\"))))","v":"Mas de una vez al año"},{"$f":"BF126","v":4},{"$f":"IF(AL126=5,\"Catastrófico - Tendría desastrosas consecuencias o efectos sobre la institución\",IF(AL126=4,\"Mayor - Tendría altas consecuencias o efectos sobre la institución\",IF(AL126=3,\"Moderado - Tendría medianas consecuencias o efectos sobre la institución\",IF(AL126=2,\"Menos - Tendría bajo impacto o efecto sobre la institución\",IF(AL126=1,\"Insignificante - tendría consecuencias o efectos mínimos en la institución\",\"Digite Valor entre 1 y 5\")))))","v":"Mayor - Tendría altas consecuencias o efectos sobre la institución"},{"$f":"CONCATENATE(AJ126,AL126)","v":"54"},{"$f":"IF(COUNTIF($CE$10:$CE$17,AN126),$CE$9,IF(COUNTIF($CF$10:$CF$17,AN126),$CF$9,IF(COUNTIF($CG$10:$CG$13,AN126),$CG$9,IF(COUNTIF($CH$10:$CH$14,AN126),$CH$9,\"\"))))","v":"Zona de Riesgo Extrema"},{"$f":"IF(AO126=$CE$9,\"E\",IF(AO126=$CF$9,\"A\",IF(AO126=$CG$9,\"M\",IF(AO126=$CH$9,\"B\",\"\"))))","v":"E"},"Se establece este control por primera vez.\nAl no existir  plan de capacitacion, se debe asignar  presupuesto anual  a la Division de tecnologia para este fin ","Calidad y cantidad de capacitaciones requeridas por el personal de soporte técnico","Jefatura de las Tics\nVicerectoria Administrativa","2016-01-01","2016-12-31","Documento de Solicitud de necesidades de capacitacion ",{"$f":"H126","v":5},{"$f":"IF(R126=\"Afecta la Probabilidad\",AW126-(AW126-AI126),\"No aplica\")","v":"No aplica"},{"$f":"K126","v":4},0,{"$f":"IF([4]Matriz!R127=\"Afecta el Impacto\",CONCATENATE(AW126,AZ126),CONCATENATE(AX126,AY126))","v":{"$error":"#REF!"}},{"$f":"IF(R126=\"\",\"\",SUMIF(R126:R134,\"Afecta la Probabilidad\",AX126:AX134))","v":0},{"$f":"IF(R126=\"\",\"\",SUMIF(R126:R134,\"Afecta el Impacto\",AZ126:AZ134))","v":0},{"$f":"IF(BB126=\"\",\"\",IF(H126-BB126<=0,1,H126-BB126))","v":5},{"$f":"CONCATENATE(BD126,BF126)","v":"54"},{"$f":"IF(K126=\"\",\"\",IF(K126-BC126<0,1,K126-BC126))","v":4}]
[null,2,{"$nulls":17},0,null,0,null,0,null,0,null,0,null,0,null,{"$f":"IF(AE127=\"Si\",30,0)","v":0},0,{"$f":"IF(R127=\"\",\"\",IF(R127=\"Afecta la Probabilidad\",IF(AND(AG127>=0,AG127<=50),\"No disminuye la Probabilidad\",IF(AND(AG127>50,AG127<=75),\"Disminuye la Probabilidad en 1\",IF(AND(AG127>75,AG127<=100),\"Disminuye la Probabilidad en 2\",\"\"))),IF(AND(AG127>=0,AG127<=50),\"No disminuye el Impacto\",IF(AND(AG127>50,AG127<=75),\"Disminuye el Impacto en 1\",IF(AND(AG127>75,AG127<=100),\"Disminuye el Impacto en 2\",\"\")))))","v":""},{"$f":"IF(AG127<=50,0,IF(AND(AG127>50,AG127<=75),1,IF(AND(AG127>75,AG127<=100),2,\"\")))","v":0},{"$nulls":14},{"$f":"IF(R127=\"Afecta la Probabilidad\",AW127-(AW127-AI127),\"No aplica\")","v":"No aplica"},null,"No aplica",{"$f":"IF([4]Matriz!R128=\"Afecta el Impacto\",CONCATENATE(AW127,AZ127),CONCATENATE(AX127,AY127))","v":{"$error":"#REF!"}}]
[null,3,{"$nulls":17},0,null,0,null,0,null,0,null,0,null,0,null,0,0,{"$f":"IF(R128=\"\",\"\",IF(R128=\"Afecta la Probabilidad\",IF(AND(AG128>=0,AG128<=50),\"No disminuye la Probabilidad\",IF(AND(AG128>50,AG128<=75),\"Disminuye la Probabilidad en 1\",IF(AND(AG128>75,AG128<=100),\"Disminuye la Probabilidad en 2\",\"\"))),IF(AND(AG128>=0,AG128<=50),\"No disminuye el Impacto\",IF(AND(AG128>50,AG128<=75),\"Disminuye el Impacto en 1\",IF(AND(AG128>75,AG128<=100),\"Disminuye el Impacto en 2\",\"\")))))","v":""},0,{"$nulls":14},{"$f":"IF(R128=\"Afecta la Probabilidad\",AW128-(AW128-AI128),\"No aplica\")","v":"No aplica"},null,"No aplica",{"$f":"IF([4]Matriz!R129=\"Afecta el Impacto\",CONCATENATE(AW128,AZ128),CONCATENATE(AX128,AY128))","v":{"$error":"#REF!"}}]
[null,4,{"$nulls":17},0,null,0,null,0,null,0,null,0,null,0,null,0,0,{"$f":"IF(R129=\"\",\"\",IF(R129=\"Afecta la Probabilidad\",IF(AND(AG129>=0,AG129<=50),\"No disminuye la Probabilidad\",IF(AND(AG129>50,AG129<=75),\"Disminuye la Probabilidad en 1\",IF(AND(AG129>75,AG129<=100),\"Disminuye la Probabilidad en 2\",\"\"))),IF(AND(AG129>=0,AG129<=50),\"No disminuye el Impacto\",IF(AND(AG129>50,AG129<=75),\"Disminuye el Impacto en 1\",IF(AND(AG129>75,AG129<=100),\"Disminuye el Impacto en 2\",\"\")))))","v":""},0,{"$nulls":14},"No aplica",null,"No aplica",{"$f":"IF([4]Matriz!R130=\"Afecta el Impacto\",CONCATENATE(AW129,AZ129),CONCATENATE(AX129,AY129))","v":{"$error":"#REF!"}}]
[null,5,{"$nulls":17},0,null,0,null,0,null,0,null,0,null,0,null,0,0,"",0,{"$nulls":14},"No aplica",null,"No aplica",{"$f":"IF([4]Matriz!R131=\"Afecta el Impacto\",CONCATENATE(AW130,AZ130),CONCATENATE(AX130,AY130))","v":{"$error":"#REF!"}}]
[null,6,{"$nulls":17},0,null,0,null,0,null,0,null,0,null,0,null,0,0,"",0,{"$nulls":14},"No aplica",null,"No aplica"]
[null,7,{"$nulls":17},0,null,0,null,0,null,0,null,0,null,0,null,0,0,"",0,{"$nulls":14},"No aplica",null,"No aplica"]
[null,8,{"$nulls":17},0,null,0,null,0,null,0,null,0,null,0,null,0,0,"",0,{"$nulls":14},"No aplica",null,"No aplica"]
[null,9,{"$nulls":17},0,null,0,null,0,null,0,null,0,null,0,null,0,0,"",0,{"$nulls":14},"No aplica",null,"No aplica",{"$f":"IF([4]Matriz!R135=\"Afecta el Impacto\",CONCATENATE(AW134,AZ134),CONCATENATE(AX134,AY134))","v":{"$error":"#REF!"}}]
["R15",1,"Factor_Interno","Personal","Gran demanda de soporte técnico","Falta de recurso humano","No seriamos eficientes, eficaces y oportunos",3,{"$f":"IF(H135=5,\"Mas de una vez al año\",IF(H135=4,\"Al menos una vez en el ultimo año\",IF(H135=3,\"Al menos una vez en los ultimos 2 años\",IF(H135=2,\"Al menos una vez en los ultimos 5 años\",\"No se ha presentado en los ultimos 5 años\"))))","v":"Al menos una vez en los ultimos 2 años"},{"$f":"CONCATENATE(H$135,K$135)","v":"34"},4,{"$f":"IF(K135=5,\"Catastrófico\",IF(K135=4,\"Mayor\",IF(K135=3,\"Moderado\",IF(K135=2,\"Menos\",IF(K135=1,\"Insignificante\",\"Digite Valor entre 1 y 5\")))))","v":"Mayor"},{"$f":"IF(L135=\"Digite Valor entre 1 y 5\",\"\",IF(COUNTIF(CE$10:CE$17,CONCATENATE(H135,K135)),CE$9,IF(COUNTIF(CF$10:CF$17,CONCATENATE(H135,K135)),CF$9,IF(COUNTIF(CG$10:CG$13,CONCATENATE(H135,K135)),CG$9,CH$9))))","v":"Zona de Riesgo Extrema"},{"$f":"IF(M135=CE$9,\"E\",IF(M135=CF$9,\"A\",IF(M135=CG$9,\"M\",IF(M135=CH$9,\"B\",\"\"))))","v":"E"},"Control Correctivo","Vinculación de personal para el área de soporte","A Solicitud","Afecta la Probabilidad","No",0,"Si",5,"No",0,"No",0,"No",0,"No",0,"No",0,5,"No disminuye la Probabilidad",0,{"$f":"BD135","v":3},{"$f":"IF(AJ135=5,\"Mas de una vez al año\",IF(AJ135=4,\"Al menos una vez en el ultimo año\",IF(AJ135=3,\"Al menos una vez en los ultimos 2 años\",IF(AJ135=2,\"Al menos una vez en los ultimos 5 años\",\"No se ha presentado en los ultimos 5 años\"))))","v":"Al menos una vez en los ultimos 2 años"},{"$f":"BF135","v":4},{"$f":"IF(AL135=5,\"Catastrófico - Tendría desastrosas consecuencias o efectos sobre la institución\",IF(AL135=4,\"Mayor - Tendría altas consecuencias o efectos sobre la institución\",IF(AL135=3,\"Moderado - Tendría medianas consecuencias o efectos sobre la institución\",IF(AL135=2,\"Menos - Tendría bajo impacto o efecto sobre la institución\",IF(AL135=1,\"Insignificante - tendría consecuencias o efectos mínimos en la institución\",\"Digite Valor entre 1 y 5\")))))","v":"Mayor - Tendría altas consecuencias o efectos sobre la institución"},{"$f":"CONCATENATE(AJ135,AL135)","v":"34"},{"$f":"IF(COUNTIF($CE$10:$CE$17,AN135),$CE$9,IF(COUNTIF($CF$10:$CF$17,AN135),$CF$9,IF(COUNTIF($CG$10:$CG$13,AN135),$CG$9,IF(COUNTIF($CH$10:$CH$14,AN135),$CH$9,\"\"))))","v":"Zona de Riesgo Extrema"},{"$f":"IF(AO135=$CE$9,\"E\",IF(AO135=$CF$9,\"A\",IF(AO135=$CG$9,\"M\",IF(AO135=$CH$9,\"B\",\"\"))))","v":"E"},"Se establece este control por primera vez.\n","Vincular y capacitar al nuevo personal\nPlan de distribución de aplicaciones\n","Jefe Oficina \nViceadministrativa","2016-01-01","2016-12-31","indicadores que  genera la aplicación de Solictudes (Helpdesk)",3,{"$f":"IF(R135=\"Afecta la Probabilidad\",AW135-(AW135-AI135),\"No aplica\")","v":0},4,"No aplica",{"$f":"IF([4]Matriz!R136=\"Afecta el Impacto\",CONCATENATE(AW135,AZ135),CONCATENATE(AX135,AY135))","v":{"$error":"#REF!"}},{"$f":"IF(R135=\"\",\"\",SUMIF(R135:R143,\"Afecta la Probabilidad\",AX135:AX143))","v":0},{"$f":"IF(R135=\"\",\"\",SUMIF(R135:R143,\"Afecta el Impacto\",AZ135:AZ143))","v":0},{"$f":"IF(BB135=\"\",\"\",IF(H135-BB135<=0,1,H135-BB135))","v":3},{"$f":"CONCATENATE(BD135,BF135)","v":"34"},{"$f":"IF(K135=\"\",\"\",IF(K135-BC135<0,1,K135-BC135))","v":4}]
[null,2,{"$nulls":4},"Generación de sobrecarga de solicitudes",{"$nulls":12},0,null,0,null,0,null,0,null,0,null,0,null,0,0,"",0,{"$nulls":14},{"$f":"IF(R136=\"Afecta la Probabilidad\",AW136-(AW136-AI136),\"No aplica\")","v":"No aplica"},null,"No aplica",{"$f":"IF([4]Matriz!R137=\"Afecta el Impacto\",CONCATENATE(AW136,AZ136),CONCATENATE(AX136,AY136))","v":{"$error":"#REF!"}}]
[null,3,{"$nulls":17},{"$f":"IF(S137=\"Si\",15,0)","v":0},null,{"$f":"IF(U137=\"Si\",5,0)","v":0},null,{"$f":"IF(W137=\"Si\",15,0)","v":0},null,{"$f":"IF(Y137=\"Si\",10,0)","v":0},null,{"$f":"IF(AA137=\"Si\",15,0)","v":0},null,{"$f":"IF(AC137=\"Si\",10,0)","v":0},null,0,0,"",0,{"$nulls":14},"No aplica",null,{"$f":"IF(R137=\"Afecta el Impacto\",AY137-(AY137-AI137),\"No aplica\")","v":"No aplica"},{"$f":"IF([4]Matriz!R138=\"Afecta el Impacto\",CONCATENATE(AW137,AZ137),CONCATENATE(AX137,AY137))","v":{"$error":"#REF!"}}]
[null,4,{"$nulls":17},0,null,0,null,0,null,0,null,0,null,0,null,0,0,"",0,{"$nulls":14},"No aplica",null,"No aplica",{"$f":"IF([4]Matriz!R139=\"Afecta el Impacto\",CONCATENATE(AW138,AZ138),CONCATENATE(AX138,AY138))","v":{"$error":"#REF!"}}]
[null,5,{"$nulls":17},0,null,0,null,0,null,0,null,0,null,0,null,0,0,"",0,{"$nulls":14},"No aplica",null,"No aplica",{"$f":"IF([4]Matriz!R140=\"Afecta el Impacto\",CONCATENATE(AW139,AZ139),CONCATENATE(AX139,AY139))","v":{"$error":"#REF!"}}]
[null,6,{"$nulls":17},0,null,0,null,0,null,0,null,0,null,0,null,0,0,"",0,{"$nulls":14},"No aplica",null,"No aplica",{"$f":"IF([4]Matriz!R141=\"Afecta el Impacto\",CONCATENATE(AW140,AZ140),CONCATENATE(AX140,AY140))","v":{"$error":"#REF!"}}]
[null,7,{"$nulls":17},0,null,0,null,0,null,0,null,0,null,0,null,0,0,"",0,{"$nulls":14},"No aplica",null,"No aplica",{"$f":"IF([4]Matriz!R142=\"Afecta el Impacto\",CONCATENATE(AW141,AZ141),CONCATENATE(AX141,AY141))","v":{"$error":"#REF!"}}]
[null,8,{"$nulls":17},0,null,0,null,0,null,0,null,0,null,0,null,0,0,"",0,{"$nulls":14},"No aplica",null,"No aplica",{"$f":"IF([4]Matriz!R143=\"Afecta el Impacto\",CONCATENATE(AW142,AZ142),CONCATENATE(AX142,AY142))","v":{"$error":"#REF!"}}]
[null,9,{"$nulls":17},0,null,0,null,0,null,0,null,0,null,0,null,0,0,"",0,{"$nulls":14},"No aplica",null,"No aplica",{"$f":"IF([4]Matriz!R144=\"Afecta el Impacto\",CONCATENATE(AW143,AZ143),CONCATENATE(AX143,AY143))","v":{"$error":"#REF!"}}]
["R16",1,"Factor_Externo","Tecnológicos","Mal uso del sistema de informacion por desconocimiento por parte de los usuarios finales","Desestabilización de los sistemas de información","Afecta la integridad , la confiabilidad de la información e inconformismo de la comunidad universitaria",3,{"$f":"IF(H144=5,\"Mas de una vez al año\",IF(H144=4,\"Al menos una vez en el ultimo año\",IF(H144=3,\"Al menos una vez en los ultimos 2 años\",IF(H144=2,\"Al menos una vez en los ultimos 5 años\",\"No se ha presentado en los ultimos 5 años\"))))","v":"Al menos una vez en los ultimos 2 años"},{"$f":"CONCATENATE(H$144,K$144)","v":"34"},4,{"$f":"IF(K144=5,\"Catastrófico\",IF(K144=4,\"Mayor\",IF(K144=3,\"Moderado\",IF(K144=2,\"Menos\",IF(K144=1,\"Insignificante\",\"Digite Valor entre 1 y 5\")))))","v":"Mayor"},{"$f":"IF(L144=\"Digite Valor entre 1 y 5\",\"\",IF(COUNTIF(CE$10:CE$17,CONCATENATE(H144,K144)),CE$9,IF(COUNTIF(CF$10:CF$17,CONCATENATE(H144,K144)),CF$9,IF(COUNTIF(CG$10:CG$13,CONCATENATE(H144,K144)),CG$9,CH$9))))","v":"Zona de Riesgo Extrema"},{"$f":"IF(M144=CE$9,\"E\",IF(M144=CF$9,\"A\",IF(M144=CG$9,\"M\",IF(M144=CH$9,\"B\",\"\"))))","v":"E"},"Control Correctivo","capacitación a  administradores funcionales y usuarios finales","A Solicitud","Afecta la Probabilidad","No",0,"Si",5,"No",0,"No",0,"No",0,"No",0,"No",0,5,"No disminuye la Probabilidad",0,{"$f":"BD144","v":3},{"$f":"IF(AJ144=5,\"Mas de una vez al año\",IF(AJ144=4,\"Al menos una vez en el ultimo año\",IF(AJ144=3,\"Al menos una vez en los ultimos 2 años\",IF(AJ144=2,\"Al menos una vez en los ultimos 5 años\",\"No se ha presentado en los ultimos 5 años\"))))","v":"Al menos una vez en los ultimos 2 años"},{"$f":"BF144","v":4},{"$f":"IF(AL144=5,\"Catastrófico - Tendría desastrosas consecuencias o efectos sobre la institución\",IF(AL144=4,\"Mayor - Tendría altas consecuencias o efectos sobre la institución\",IF(AL144=3,\"Moderado - Tendría medianas consecuencias o efectos sobre la institución\",IF(AL144=2,\"Menos - Tendría bajo impacto o efecto sobre la institución\",IF(AL144=1,\"Insignificante - tendría consecuencias o efectos mínimos en la institución\",\"Digite Valor entre 1 y 5\")))))","v":"Mayor - Tendría altas consecuencias o efectos sobre la institución"},{"$f":"CONCATENATE(AJ144,AL144)","v":"34"},{"$f":"IF(COUNTIF($CE$10:$CE$17,AN144),$CE$9,IF(COUNTIF($CF$10:$CF$17,AN144),$CF$9,IF(COUNTIF($CG$10:$CG$13,AN144),$CG$9,IF(COUNTIF($CH$10:$CH$14,AN144),$CH$9,\"\"))))","v":"Zona de Riesgo Extrema"},{"$f":"IF(AO144=$CE$9,\"E\",IF(AO144=$CF$9,\"A\",IF(AO144=$CG$9,\"M\",IF(AO144=$CH$9,\"B\",\"\"))))","v":"E"},"Se establece por primera vez.\n","Actualización continua del proceso  a cargo y de la aplicación","Area de soporte                   Usuarios finales y Administrador funcional","2016-01-01","2016-12-31","Actas de capacitacion",{"$f":"H144","v":3},0,{"$f":"K144","v":4},"No aplica",{"$f":"IF([4]Matriz!R145=\"Afecta el Impacto\",CONCATENATE(AW144,AZ144),CONCATENATE(AX144,AY144))","v":{"$error":"#REF!"}},{"$f":"IF(R144=\"\",\"\",SUMIF(R144:R152,\"Afecta la Probabilidad\",AX144:AX152))","v":0},{"$f":"IF(R144=\"\",\"\",SUMIF(R144:R152,\"Afecta el Impacto\",AZ144:AZ152))","v":0},{"$f":"IF(BB144=\"\",\"\",IF(H144-BB144<=0,1,H144-BB144))","v":3},{"$f":"CONCATENATE(BD144,BF144)","v":"34"},{"$f":"IF(K144=\"\",\"\",IF(K144-BC144<0,1,K144-BC144))","v":4}]
[null,2,{"$nulls":12},"Control Correctivo","Las aplicaciones deben de estar a cargo del personal de planta en la Divsion de las Tic","Continuo","Afecta el Impacto","No",0,"Si",5,"No",0,"No",0,"No",0,"No",0,"No",0,5,{"$f":"IF(R145=\"\",\"\",IF(R145=\"Afecta la Probabilidad\",IF(AND(AG145>=0,AG145<=50),\"No disminuye la Probabilidad\",IF(AND(AG145>50,AG145<=75),\"Disminuye la Probabilidad en 1\",IF(AND(AG145>75,AG145<=100),\"Disminuye la Probabilidad en 2\",\"\"))),IF(AND(AG145>=0,AG145<=50),\"No disminuye el Impacto\",IF(AND(AG145>50,AG145<=75),\"Disminuye el Impacto en 1\",IF(AND(AG145>75,AG145<=100),\"Disminuye el Impacto en 2\",\"\")))))","v":"No disminuye el Impacto"},0,{"$nulls":7},"Se establece por primera vez.\n","Informar al jefe inmediato","Jefe Oficina \n","2016-01-01","2016-12-31","Informes",null,"No aplica",null,0,{"$f":"IF([4]Matriz!R146=\"Afecta el Impacto\",CONCATENATE(AW145,AZ145),CONCATENATE(AX145,AY145))","v":{"$error":"#REF!"}}]
[null,3,{"$nulls":12},"Control Correctivo","Monitoreo e informe de incidencias","A Solicitud","Afecta la Probabilidad",null,0,"Si",5,null,0,null,0,null,0,null,0,null,0,5,{"$f":"IF(R146=\"\",\"\",IF(R146=\"Afecta la Probabilidad\",IF(AND(AG146>=0,AG146<=50),\"No disminuye la Probabilidad\",IF(AND(AG146>50,AG146<=75),\"Disminuye la Probabilidad en 1\",IF(AND(AG146>75,AG146<=100),\"Disminuye la Probabilidad en 2\",\"\"))),IF(AND(AG146>=0,AG146<=50),\"No disminuye el Impacto\",IF(AND(AG146>50,AG146<=75),\"Disminuye el Impacto en 1\",IF(AND(AG146>75,AG146<=100),\"Disminuye el Impacto en 2\",\"\")))))","v":"No disminuye la Probabilidad"},0,{"$nulls":7},"Se establece por primera vez.\n","Seguimiento y monitoreo continuo de las aplicaciones","Area de soporte","2016-01-01","2016-12-31","Reporte de segumineto",null,0,null,"No aplica",{"$f":"IF([4]Matriz!R147=\"Afecta el Impacto\",CONCATENATE(AW146,AZ146),CONCATENATE(AX146,AY146))","v":{"$error":"#REF!"}}]
[null,4,{"$nulls":17},0,null,0,null,0,null,0,null,0,null,0,null,0,{"$f":"T147+V147+X147+Z147+AB147+AD147+AF147","v":0},{"$f":"IF(R147=\"\",\"\",IF(R147=\"Afecta la Probabilidad\",IF(AND(AG147>=0,AG147<=50),\"No disminuye la Probabilidad\",IF(AND(AG147>50,AG147<=75),\"Disminuye la Probabilidad en 1\",IF(AND(AG147>75,AG147<=100),\"Disminuye la Probabilidad en 2\",\"\"))),IF(AND(AG147>=0,AG147<=50),\"No disminuye el Impacto\",IF(AND(AG147>50,AG147<=75),\"Disminuye el Impacto en 1\",IF(AND(AG147>75,AG147<=100),\"Disminuye el Impacto en 2\",\"\")))))","v":""},0,{"$nulls":14},"No aplica",null,"No aplica",{"$f":"IF([4]Matriz!R148=\"Afecta el Impacto\",CONCATENATE(AW147,AZ147),CONCATENATE(AX147,AY147))","v":{"$error":"#REF!"}}]
[null,5,{"$nulls":17},0,null,0,null,0,null,0,null,0,null,0,null,0,0,{"$f":"IF(R148=\"\",\"\",IF(R148=\"Afecta la Probabilidad\",IF(AND(AG148>=0,AG148<=50),\"No disminuye la Probabilidad\",IF(AND(AG148>50,AG148<=75),\"Disminuye la Probabilidad en 1\",IF(AND(AG148>75,AG148<=100),\"Disminuye la Probabilidad en 2\",\"\"))),IF(AND(AG148>=0,AG148<=50),\"No disminuye el Impacto\",IF(AND(AG148>50,AG148<=75),\"Disminuye el Impacto en 1\",IF(AND(AG148>75,AG148<=100),\"Disminuye el Impacto en 2\",\"\")))))","v":""},0,{"$nulls":14},"No aplica",null,"No aplica",{"$f":"IF([4]Matriz!R149=\"Afecta el Impacto\",CONCATENATE(AW148,AZ148),CONCATENATE(AX148,AY148))","v":{"$error":"#REF!"}}]
[null,6,{"$nulls":17},0,null,0,null,0,null,0,null,0,null,0,null,0,0,"",0,{"$nulls":14},"No aplica",null,"No aplica",{"$f":"IF([4]Matriz!R150=\"Afecta el Impacto\",CONCATENATE(AW149,AZ149),CONCATENATE(AX149,AY149))","v":{"$error":"#REF!"}}]
[null,7,{"$nulls":17},0,null,0,null,0,null,0,null,0,null,0,null,0,0,"",0,{"$nulls":14},"No aplica",null,"No aplica",{"$f":"IF([4]Matriz!R151=\"Afecta el Impacto\",CONCATENATE(AW150,AZ150),CONCATENATE(AX150,AY150))","v":{"$error":"#REF!"}}]
[null,8,{"$nulls":17},0,null,0,null,0,null,0,null,0,null,0,null,0,0,"",0,{"$nulls":14},"No aplica",null,"No aplica",{"$f":"IF([4]Matriz!R152=\"Afecta el Impacto\",CONCATENATE(AW151,AZ151),CONCATENATE(AX151,AY151))","v":{"$error":"#REF!"}}]
[null,9,{"$nulls":17},0,null,0,null,0,null,0,null,0,null,0,null,0,0,"",0,{"$nulls":14},"No aplica",null,"No aplica",{"$f":"IF([4]Matriz!R153=\"Afecta el Impacto\",CONCATENATE(AW152,AZ152),CONCATENATE(AX152,AY152))","v":{"$error":"#REF!"}}]
["R17",1,"Factor_Externo","Procesos","Cambio constante en los requerimientos por parte de los clientes de las aplicaciones a desarrollar","Modificación en los criterios iniciales de aceptación de las aplicaciones desarrolladas","Inconsistencia en la información.",5,{"$f":"IF(H153=5,\"Mas de una vez al año\",IF(H153=4,\"Al menos una vez en el ultimo año\",IF(H153=3,\"Al menos una vez en los ultimos 2 años\",IF(H153=2,\"Al menos una vez en los ultimos 5 años\",\"No se ha presentado en los ultimos 5 años\"))))","v":"Mas de una vez al año"},{"$f":"CONCATENATE(H$153,K$153)","v":"54"},4,{"$f":"IF(K153=5,\"Catastrófico\",IF(K153=4,\"Mayor\",IF(K153=3,\"Moderado\",IF(K153=2,\"Menos\",IF(K153=1,\"Insignificante\",\"Digite Valor entre 1 y 5\")))))","v":"Mayor"},{"$f":"IF(L153=\"Digite Valor entre 1 y 5\",\"\",IF(COUNTIF(CE$10:CE$17,CONCATENATE(H153,K153)),CE$9,IF(COUNTIF(CF$10:CF$17,CONCATENATE(H153,K153)),CF$9,IF(COUNTIF(CG$10:CG$13,CONCATENATE(H153,K153)),CG$9,CH$9))))","v":"Zona de Riesgo Extrema"},"E","Control Preventivo","Metodologia de desarrollo (Levantamiento de requerimientos)","A Solicitud","Afecta el Impacto","Si",15,"Si",5,"No",0,"Si",10,"Si",15,"Si",10,"Si",{"$f":"IF(AE153=\"Si\",30,0)","v":30},85,{"$f":"IF(R153=\"\",\"\",IF(R153=\"Afecta la Probabilidad\",IF(AND(AG153>=0,AG153<=50),\"No disminuye la Probabilidad\",IF(AND(AG153>50,AG153<=75),\"Disminuye la Probabilidad en 1\",IF(AND(AG153>75,AG153<=100),\"Disminuye la Probabilidad en 2\",\"\"))),IF(AND(AG153>=0,AG153<=50),\"No disminuye el Impacto\",IF(AND(AG153>50,AG153<=75),\"Disminuye el Impacto en 1\",IF(AND(AG153>75,AG153<=100),\"Disminuye el Impacto en 2\",\"\")))))","v":"Disminuye el Impacto en 2"},{"$f":"IF(AG153<=50,0,IF(AND(AG153>50,AG153<=75),1,IF(AND(AG153>75,AG153<=100),2,\"\")))","v":2},{"$f":"BD153","v":5},{"$f":"IF(AJ153=5,\"Mas de una vez al año\",IF(AJ153=4,\"Al menos una vez en el ultimo año\",IF(AJ153=3,\"Al menos una vez en los ultimos 2 años\",IF(AJ153=2,\"Al menos una vez en los ultimos 5 años\",\"No se ha presentado en los ultimos 5 años\"))))","v":"Mas de una vez al año"},{"$f":"BF153","v":2},{"$f":"IF(AL153=5,\"Catastrófico - Tendría desastrosas consecuencias o efectos sobre la institución\",IF(AL153=4,\"Mayor - Tendría altas consecuencias o efectos sobre la institución\",IF(AL153=3,\"Moderado - Tendría medianas consecuencias o efectos sobre la institución\",IF(AL153=2,\"Menos - Tendría bajo impacto o efecto sobre la institución\",IF(AL153=1,\"Insignificante - tendría consecuencias o efectos mínimos en la institución\",\"Digite Valor entre 1 y 5\")))))","v":"Menos - Tendría bajo impacto o efecto sobre la institución"},{"$f":"CONCATENATE(AJ153,AL153)","v":"52"},{"$f":"IF(COUNTIF($CE$10:$CE$17,AN153),$CE$9,IF(COUNTIF($CF$10:$CF$17,AN153),$CF$9,IF(COUNTIF($CG$10:$CG$13,AN153),$CG$9,IF(COUNTIF($CH$10:$CH$14,AN153),$CH$9,\"\"))))","v":"Zona de Riesgo Alta"},{"$f":"IF(AO153=$CE$9,\"E\",IF(AO153=$CF$9,\"A\",IF(AO153=$CG$9,\"M\",IF(AO153=$CH$9,\"B\",\"\"))))","v":"A"},"Cumplir la metodologia","Revisión periódica del cumplimiento de la aplicación de la metodologia","Desarrolladores","2016-01-01","2016-12-31","Documentación generada",{"$f":"H153","v":5},{"$f":"IF(R153=\"Afecta la Probabilidad\",AW153-(AW153-AI153),\"No aplica\")","v":"No aplica"},{"$f":"K153","v":4},2,{"$f":"IF([5]Matriz!R154=\"Afecta el Impacto\",CONCATENATE(AW153,AZ153),CONCATENATE(AX153,AY153))","v":{"$error":"#REF!"}},{"$f":"IF(R153=\"\",\"\",SUMIF(R153:R161,\"Afecta la Probabilidad\",AX153:AX161))","v":0},{"$f":"IF(R153=\"\",\"\",SUMIF(R153:R161,\"Afecta el Impacto\",AZ153:AZ161))","v":2},{"$f":"IF(BB153=\"\",\"\",IF(H153-BB153<=0,1,H153-BB153))","v":5},{"$f":"CONCATENATE(BD153,BF153)","v":"52"},{"$f":"IF(K153=\"\",\"\",IF(K153-BC153<0,1,K153-BC153))","v":2}]
[null,2,{"$nulls":4},"Retrasos en la entrega de las aplicaciones",{"$nulls":12},0,null,0,null,0,null,0,null,0,null,0,null,{"$f":"IF(AE154=\"Si\",30,0)","v":0},0,{"$f":"IF(R154=\"\",\"\",IF(R154=\"Afecta la Probabilidad\",IF(AND(AG154>=0,AG154<=50),\"No disminuye la Probabilidad\",IF(AND(AG154>50,AG154<=75),\"Disminuye la Probabilidad en 1\",IF(AND(AG154>75,AG154<=100),\"Disminuye la Probabilidad en 2\",\"\"))),IF(AND(AG154>=0,AG154<=50),\"No disminuye el Impacto\",IF(AND(AG154>50,AG154<=75),\"Disminuye el Impacto en 1\",IF(AND(AG154>75,AG154<=100),\"Disminuye el Impacto en 2\",\"\")))))","v":""},{"$f":"IF(AG154<=50,0,IF(AND(AG154>50,AG154<=75),1,IF(AND(AG154>75,AG154<=100),2,\"\")))","v":0},{"$nulls":14},{"$f":"IF(R154=\"Afecta la Probabilidad\",AW154-(AW154-AI154),\"No aplica\")","v":"No aplica"},null,"No aplica",{"$f":"IF([5]Matriz!R155=\"Afecta el Impacto\",CONCATENATE(AW154,AZ154),CONCATENATE(AX154,AY154))","v":{"$error":"#REF!"}}]
[null,3,{"$nulls":4},"Insastifacción de clientes",{"$nulls":12},0,null,0,null,0,null,0,null,0,null,0,null,0,0,{"$f":"IF(R155=\"\",\"\",IF(R155=\"Afecta la Probabilidad\",IF(AND(AG155>=0,AG155<=50),\"No disminuye la Probabilidad\",IF(AND(AG155>50,AG155<=75),\"Disminuye la Probabilidad en 1\",IF(AND(AG155>75,AG155<=100),\"Disminuye la Probabilidad en 2\",\"\"))),IF(AND(AG155>=0,AG155<=50),\"No disminuye el Impacto\",IF(AND(AG155>50,AG155<=75),\"Disminuye el Impacto en 1\",IF(AND(AG155>75,AG155<=100),\"Disminuye el Impacto en 2\",\"\")))))","v":""},0,{"$nulls":14},{"$f":"IF(R155=\"Afecta la Probabilidad\",AW155-(AW155-AI155),\"No aplica\")","v":"No aplica"},null,"No aplica",{"$f":"IF([5]Matriz!R156=\"Afecta el Impacto\",CONCATENATE(AW155,AZ155),CONCATENATE(AX155,AY155))","v":{"$error":"#REF!"}}]
[null,4,{"$nulls":17},0,null,0,null,0,null,0,null,0,null,0,null,0,0,{"$f":"IF(R156=\"\",\"\",IF(R156=\"Afecta la Probabilidad\",IF(AND(AG156>=0,AG156<=50),\"No disminuye la Probabilidad\",IF(AND(AG156>50,AG156<=75),\"Disminuye la Probabilidad en 1\",IF(AND(AG156>75,AG156<=100),\"Disminuye la Probabilidad en 2\",\"\"))),IF(AND(AG156>=0,AG156<=50),\"No disminuye el Impacto\",IF(AND(AG156>50,AG156<=75),\"Disminuye el Impacto en 1\",IF(AND(AG156>75,AG156<=100),\"Disminuye el Impacto en 2\",\"\")))))","v":""},0,{"$nulls":14},"No aplica",null,"No aplica",{"$f":"IF([5]Matriz!R157=\"Afecta el Impacto\",CONCATENATE(AW156,AZ156),CONCATENATE(AX156,AY156))","v":{"$error":"#REF!"}}]
[null,5,{"$nulls":17},0,null,0,null,0,null,0,null,0,null,0,null,0,0,"",0,{"$nulls":14},"No aplica",null,"No aplica",{"$f":"IF([5]Matriz!R158=\"Afecta el Impacto\",CONCATENATE(AW157,AZ157),CONCATENATE(AX157,AY157))","v":{"$error":"#REF!"}}]
[null,6,{"$nulls":17},0,null,0,null,0,null,0,null,0,null,0,null,0,0,"",0,{"$nulls":14},"No aplica",null,"No aplica"]
[null,7,{"$nulls":17},0,null,0,null,0,null,0,null,0,null,0,null,0,0,"",0,{"$nulls":14},"No aplica",null,"No aplica"]
[null,8,{"$nulls":17},0,null,0,null,0,null,0,null,0,null,0,null,0,0,"",0,{"$nulls":14},"No aplica",null,"No aplica"]
[null,9,{"$nulls":17},0,null,0,null,0,null,0,null,0,null,0,null,0,0,"",0,{"$nulls":14},"No aplica",null,"No aplica",{"$f":"IF([5]Matriz!R162=\"Afecta el Impacto\",CONCATENATE(AW161,AZ161),CONCATENATE(AX161,AY161))","v":{"$error":"#REF!"}}]
["R18",1,"Factor_Interno","Procesos","Equipos de computo  ineficientes, en los cuales las aplicaciones software del entorno de desarrollo utilizado no se ejecutan debidamente","Pérdida de información","Retrasos en la entrega de las aplicaciones",4,{"$f":"IF(H162=5,\"Mas de una vez al año\",IF(H162=4,\"Al menos una vez en el ultimo año\",IF(H162=3,\"Al menos una vez en los ultimos 2 años\",IF(H162=2,\"Al menos una vez en los ultimos 5 años\",\"No se ha presentado en los ultimos 5 años\"))))","v":"Al menos una vez en el ultimo año"},{"$f":"CONCATENATE(H$162,K$162)","v":"43"},3,{"$f":"IF(K162=5,\"Catastrófico\",IF(K162=4,\"Mayor\",IF(K162=3,\"Moderado\",IF(K162=2,\"Menos\",IF(K162=1,\"Insignificante\",\"Digite Valor entre 1 y 5\")))))","v":"Moderado"},{"$f":"IF(L162=\"Digite Valor entre 1 y 5\",\"\",IF(COUNTIF(CE$10:CE$17,CONCATENATE(H162,K162)),CE$9,IF(COUNTIF(CF$10:CF$17,CONCATENATE(H162,K162)),CF$9,IF(COUNTIF(CG$10:CG$13,CONCATENATE(H162,K162)),CG$9,CH$9))))","v":"Zona de Riesgo Alta"},{"$f":"IF(M162=CE$9,\"E\",IF(M162=CF$9,\"A\",IF(M162=CG$9,\"M\",IF(M162=CH$9,\"B\",\"\"))))","v":"A"},"Control Correctivo","Adquirir nuevos equipos de computo para desarolladores","A Solicitud","Afecta el Impacto","No",0,"Si",5,"No",0,"Si",10,"No",0,"No",0,"No",0,15,"No disminuye el Impacto",0,{"$f":"BD162","v":4},{"$f":"IF(AJ162=5,\"Mas de una vez al año\",IF(AJ162=4,\"Al menos una vez en el ultimo año\",IF(AJ162=3,\"Al menos una vez en los ultimos 2 años\",IF(AJ162=2,\"Al menos una vez en los ultimos 5 años\",\"No se ha presentado en los ultimos 5 años\"))))","v":"Al menos una vez en el ultimo año"},{"$f":"BF162","v":3},{"$f":"IF(AL162=5,\"Catastrófico - Tendría desastrosas consecuencias o efectos sobre la institución\",IF(AL162=4,\"Mayor - Tendría altas consecuencias o efectos sobre la institución\",IF(AL162=3,\"Moderado - Tendría medianas consecuencias o efectos sobre la institución\",IF(AL162=2,\"Menos - Tendría bajo impacto o efecto sobre la institución\",IF(AL162=1,\"Insignificante - tendría consecuencias o efectos mínimos en la institución\",\"Digite Valor entre 1 y 5\")))))","v":"Moderado - Tendría medianas consecuencias o efectos sobre la institución"},{"$f":"CONCATENATE(AJ162,AL162)","v":"43"},{"$f":"IF(COUNTIF($CE$10:$CE$17,AN162),$CE$9,IF(COUNTIF($CF$10:$CF$17,AN162),$CF$9,IF(COUNTIF($CG$10:$CG$13,AN162),$CG$9,IF(COUNTIF($CH$10:$CH$14,AN162),$CH$9,\"\"))))","v":"Zona de Riesgo Alta"},{"$f":"IF(AO162=$CE$9,\"E\",IF(AO162=$CF$9,\"A\",IF(AO162=$CG$9,\"M\",IF(AO162=$CH$9,\"B\",\"\"))))","v":"A"},"Establecer politica de recambio y actualización de equipos de computo","Adquirir equipos de computo para desarrolladores","Jefe de la división","2016-01-01","2016-12-31","Solicitud,CDP, RDP",4,{"$f":"IF(R162=\"Afecta la Probabilidad\",AW162-(AW162-AI162),\"No aplica\")","v":"No aplica"},3,0,{"$f":"IF([5]Matriz!R163=\"Afecta el Impacto\",CONCATENATE(AW162,AZ162),CONCATENATE(AX162,AY162))","v":{"$error":"#REF!"}},{"$f":"IF(R162=\"\",\"\",SUMIF(R162:R170,\"Afecta la Probabilidad\",AX162:AX170))","v":0},{"$f":"IF(R162=\"\",\"\",SUMIF(R162:R170,\"Afecta el Impacto\",AZ162:AZ170))","v":0},{"$f":"IF(BB162=\"\",\"\",IF(H162-BB162<=0,1,H162-BB162))","v":4},{"$f":"CONCATENATE(BD162,BF162)","v":"43"},{"$f":"IF(K162=\"\",\"\",IF(K162-BC162<0,1,K162-BC162))","v":3}]
[null,2,{"$nulls":17},0,null,0,null,0,null,0,null,0,null,0,null,0,0,"",0,{"$nulls":14},{"$f":"IF(R163=\"Afecta la Probabilidad\",AW163-(AW163-AI163),\"No aplica\")","v":"No aplica"},null,"No aplica",{"$f":"IF([5]Matriz!R164=\"Afecta el Impacto\",CONCATENATE(AW163,AZ163),CONCATENATE(AX163,AY163))","v":{"$error":"#REF!"}}]
[null,3,{"$nulls":17},0,null,0,null,0,null,0,null,0,null,0,null,0,0,"",0,{"$nulls":14},"No aplica",null,"No aplica",{"$f":"IF([5]Matriz!R165=\"Afecta el Impacto\",CONCATENATE(AW164,AZ164),CONCATENATE(AX164,AY164))","v":{"$error":"#REF!"}}]
[null,4,{"$nulls":17},0,null,0,null,0,null,0,null,0,null,0,null,0,0,"",0,{"$nulls":14},"No aplica",null,"No aplica",{"$f":"IF([5]Matriz!R166=\"Afecta el Impacto\",CONCATENATE(AW165,AZ165),CONCATENATE(AX165,AY165))","v":{"$error":"#REF!"}}]
[null,5,{"$nulls":17},0,null,0,null,0,null,0,null,0,null,0,null,0,0,"",0,{"$nulls":14},"No aplica",null,"No aplica",{"$f":"IF([5]Matriz!R167=\"Afecta el Impacto\",CONCATENATE(AW166,AZ166),CONCATENATE(AX166,AY166))","v":{"$error":"#REF!"}}]
[null,6,{"$nulls":17},0,null,0,null,0,null,0,null,0,null,0,null,0,0,"",0,{"$nulls":14},"No aplica",null,"No aplica",{"$f":"IF([5]Matriz!R168=\"Afecta el Impacto\",CONCATENATE(AW167,AZ167),CONCATENATE(AX167,AY167))","v":{"$error":"#REF!"}}]
[null,7,{"$nulls":17},0,null,0,null,0,null,0,null,0,null,0,null,0,0,"",0,{"$nulls":14},"No aplica",null,"No aplica",{"$f":"IF([5]Matriz!R169=\"Afecta el Impacto\",CONCATENATE(AW168,AZ168),CONCATENATE(AX168,AY168))","v":{"$error":"#REF!"}}]
[null,8,{"$nulls":17},0,null,0,null,0,null,0,null,0,null,0,null,0,0,"",0,{"$nulls":14},"No aplica",null,"No aplica",{"$f":"IF([5]Matriz!R170=\"Afecta el Impacto\",CONCATENATE(AW169,AZ169),CONCATENATE(AX169,AY169))","v":{"$error":"#REF!"}}]
[null,9,{"$nulls":17},0,null,0,null,0,null,0,null,0,null,0,null,0,0,"",0,{"$nulls":14},"No aplica",null,"No aplica",{"$f":"IF([5]Matriz!R171=\"Afecta el Impacto\",CONCATENATE(AW170,AZ170),CONCATENATE(AX170,AY170))","v":{"$error":"#REF!"}}]
["R19",1,"Factor_Interno","Tecnología","Falta de instructivos ","Recibir y registrar atenciones de forma inadecuada","Disminución en la calidad del servicio o usuario insatisfecho",3,{"$f":"IF(H171=5,\"Mas de una vez al año\",IF(H171=4,\"Al menos una vez en el ultimo año\",IF(H171=3,\"Al menos una vez en los ultimos 2 años\",IF(H171=2,\"Al menos una vez en los ultimos 5 años\",\"No se ha presentado en los ultimos 5 años\"))))","v":"Al menos una vez en los ultimos 2 años"},{"$f":"CONCATENATE(H$171,K$171)","v":"35"},5,{"$f":"IF(K171=5,\"Catastrófico\",IF(K171=4,\"Mayor\",IF(K171=3,\"Moderado\",IF(K171=2,\"Menos\",IF(K171=1,\"Insignificante\",\"Digite Valor entre 1 y 5\")))))","v":"Catastrófico"},{"$f":"IF(L171=\"Digite Valor entre 1 y 5\",\"\",IF(COUNTIF(CE$10:CE$17,CONCATENATE(H171,K171)),CE$9,IF(COUNTIF(CF$10:CF$17,CONCATENATE(H171,K171)),CF$9,IF(COUNTIF(CG$10:CG$13,CONCATENATE(H171,K171)),CG$9,CH$9))))","v":"Zona de Riesgo Extrema"},"E","Control Preventivo","Capacitación dell personal en el manejo del sistema Help  Desk e Instructivos actualizados","Trimestral","Afecta el Impacto","Si",15,"si",5,"No",0,"si",10,"si",15,"No",0,"si",{"$f":"IF(AE171=\"Si\",30,0)","v":30},75,{"$f":"IF(R171=\"\",\"\",IF(R171=\"Afecta la Probabilidad\",IF(AND(AG171>=0,AG171<=50),\"No disminuye la Probabilidad\",IF(AND(AG171>50,AG171<=75),\"Disminuye la Probabilidad en 1\",IF(AND(AG171>75,AG171<=100),\"Disminuye la Probabilidad en 2\",\"\"))),IF(AND(AG171>=0,AG171<=50),\"No disminuye el Impacto\",IF(AND(AG171>50,AG171<=75),\"Disminuye el Impacto en 1\",IF(AND(AG171>75,AG171<=100),\"Disminuye el Impacto en 2\",\"\")))))","v":"Disminuye el Impacto en 1"},{"$f":"IF(AG171<=50,0,IF(AND(AG171>50,AG171<=75),1,IF(AND(AG171>75,AG171<=100),2,\"\")))","v":1},{"$f":"BD171","v":3},{"$f":"IF(AJ171=5,\"Mas de una vez al año\",IF(AJ171=4,\"Al menos una vez en el ultimo año\",IF(AJ171=3,\"Al menos una vez en los ultimos 2 años\",IF(AJ171=2,\"Al menos una vez en los ultimos 5 años\",\"No se ha presentado en los ultimos 5 años\"))))","v":"Al menos una vez en los ultimos 2 años"},{"$f":"BF171","v":4},{"$f":"IF(AL171=5,\"Catastrófico - Tendría desastrosas consecuencias o efectos sobre la institución\",IF(AL171=4,\"Mayor - Tendría altas consecuencias o efectos sobre la institución\",IF(AL171=3,\"Moderado - Tendría medianas consecuencias o efectos sobre la institución\",IF(AL171=2,\"Menos - Tendría bajo impacto o efecto sobre la institución\",IF(AL171=1,\"Insignificante - tendría consecuencias o efectos mínimos en la institución\",\"Digite Valor entre 1 y 5\")))))","v":"Mayor - Tendría altas consecuencias o efectos sobre la institución"},{"$f":"CONCATENATE(AJ171,AL171)","v":"34"},{"$f":"IF(COUNTIF($CE$10:$CE$17,AN171),$CE$9,IF(COUNTIF($CF$10:$CF$17,AN171),$CF$9,IF(COUNTIF($CG$10:$CG$13,AN171),$CG$9,IF(COUNTIF($CH$10:$CH$14,AN171),$CH$9,\"\"))))","v":"Zona de Riesgo Extrema"},{"$f":"IF(AO171=$CE$9,\"E\",IF(AO171=$CF$9,\"A\",IF(AO171=$CG$9,\"M\",IF(AO171=$CH$9,\"B\",\"\"))))","v":"E"},"Se debe tebe documentar en un repositorio las las capacitaciones y actualizaciones a l instructivo","Capacitación y actualización periódica del personal y al instructivo","coordinador de área","2015-11-25","2016-07-25","Registro con las acciones de mejora ",{"$f":"H171","v":3},{"$f":"IF(R171=\"Afecta la Probabilidad\",AW171-(AW171-AI171),\"No aplica\")","v":"No aplica"},{"$f":"K171","v":5},1,{"$f":"IF([6]Matriz!R172=\"Afecta el Impacto\",CONCATENATE(AW171,AZ171),CONCATENATE(AX171,AY171))","v":{"$error":"#REF!"}},{"$f":"IF(R171=\"\",\"\",SUMIF(R171:R179,\"Afecta la Probabilidad\",AX171:AX179))","v":0},{"$f":"IF(R171=\"\",\"\",SUMIF(R171:R179,\"Afecta el Impacto\",AZ171:AZ179))","v":1},{"$f":"IF(BB171=\"\",\"\",IF(H171-BB171<=0,1,H171-BB171))","v":3},{"$f":"CONCATENATE(BD171,BF171)","v":"34"},{"$f":"IF(K171=\"\",\"\",IF(K171-BC171<0,1,K171-BC171))","v":4}]
[null,2,"Factor_Interno","Personal","Falta de capacitación al personal que ingresa al área",null,"Interrupción de las actividades desarrolladas",{"$nulls":12},0,null,0,null,0,null,0,null,0,null,0,null,{"$f":"IF(AE172=\"Si\",30,0)","v":0},0,{"$f":"IF(R172=\"\",\"\",IF(R172=\"Afecta la Probabilidad\",IF(AND(AG172>=0,AG172<=50),\"No disminuye la Probabilidad\",IF(AND(AG172>50,AG172<=75),\"Disminuye la Probabilidad en 1\",IF(AND(AG172>75,AG172<=100),\"Disminuye la Probabilidad en 2\",\"\"))),IF(AND(AG172>=0,AG172<=50),\"No disminuye el Impacto\",IF(AND(AG172>50,AG172<=75),\"Disminuye el Impacto en 1\",IF(AND(AG172>75,AG172<=100),\"Disminuye el Impacto en 2\",\"\")))))","v":""},{"$f":"IF(AG172<=50,0,IF(AND(AG172>50,AG172<=75),1,IF(AND(AG172>75,AG172<=100),2,\"\")))","v":0},{"$nulls":14},{"$f":"IF(R172=\"Afecta la Probabilidad\",AW172-(AW172-AI172),\"No aplica\")","v":"No aplica"},null,"No aplica",{"$f":"IF([6]Matriz!R173=\"Afecta el Impacto\",CONCATENATE(AW172,AZ172),CONCATENATE(AX172,AY172))","v":{"$error":"#REF!"}}]
[null,3,"Factor_Interno","Personal","Captura inadecuada de la información de requerimiento y/o necesidades del usuario",null,"Pérdida de la información suminstrada por el usuario",{"$nulls":12},0,null,0,null,0,null,0,null,0,null,0,null,0,0,{"$f":"IF(R173=\"\",\"\",IF(R173=\"Afecta la Probabilidad\",IF(AND(AG173>=0,AG173<=50),\"No disminuye la Probabilidad\",IF(AND(AG173>50,AG173<=75),\"Disminuye la Probabilidad en 1\",IF(AND(AG173>75,AG173<=100),\"Disminuye la Probabilidad en 2\",\"\"))),IF(AND(AG173>=0,AG173<=50),\"No disminuye el Impacto\",IF(AND(AG173>50,AG173<=75),\"Disminuye el Impacto en 1\",IF(AND(AG173>75,AG173<=100),\"Disminuye el Impacto en 2\",\"\")))))","v":""},0,{"$nulls":14},{"$f":"IF(R173=\"Afecta la Probabilidad\",AW173-(AW173-AI173),\"No aplica\")","v":"No aplica"},null,"No aplica",{"$f":"IF([6]Matriz!R174=\"Afecta el Impacto\",CONCATENATE(AW173,AZ173),CONCATENATE(AX173,AY173))","v":{"$error":"#REF!"}}]
[null,4,{"$nulls":4},"Instabilidad de los procesos",{"$nulls":12},0,null,0,null,0,null,0,null,0,null,0,null,0,0,{"$f":"IF(R174=\"\",\"\",IF(R174=\"Afecta la Probabilidad\",IF(AND(AG174>=0,AG174<=50),\"No disminuye la Probabilidad\",IF(AND(AG174>50,AG174<=75),\"Disminuye la Probabilidad en 1\",IF(AND(AG174>75,AG174<=100),\"Disminuye la Probabilidad en 2\",\"\"))),IF(AND(AG174>=0,AG174<=50),\"No disminuye el Impacto\",IF(AND(AG174>50,AG174<=75),\"Disminuye el Impacto en 1\",IF(AND(AG174>75,AG174<=100),\"Disminuye el Impacto en 2\",\"\")))))","v":""},0,{"$nulls":14},"No aplica",null,"No aplica",{"$f":"IF([6]Matriz!R175=\"Afecta el Impacto\",CONCATENATE(AW174,AZ174),CONCATENATE(AX174,AY174))","v":{"$error":"#REF!"}}]
[null,5,{"$nulls":4},"insatisfacción del usuario",{"$nulls":12},0,null,0,null,0,null,0,null,0,null,0,null,0,0,"",0,{"$nulls":14},"No aplica",null,"No aplica",{"$f":"IF([6]Matriz!R176=\"Afecta el Impacto\",CONCATENATE(AW175,AZ175),CONCATENATE(AX175,AY175))","v":{"$error":"#REF!"}}]
[null,6,{"$nulls":17},0,null,0,null,0,null,0,null,0,null,0,null,0,0,"",0,{"$nulls":14},"No aplica",null,"No aplica"]
[null,7,{"$nulls":17},0,null,0,null,0,null,0,null,0,null,0,null,0,0,"",0,{"$nulls":14},"No aplica",null,"No aplica"]
[null,8,{"$nulls":17},0,null,0,null,0,null,0,null,0,null,0,null,0,0,"",0,{"$nulls":14},"No aplica",null,"No aplica"]
[null,9,{"$nulls":17},0,null,0,null,0,null,0,null,0,null,0,null,0,0,"",0,{"$nulls":14},"No aplica",null,"No aplica",{"$f":"IF([6]Matriz!R180=\"Afecta el Impacto\",CONCATENATE(AW179,AZ179),CONCATENATE(AX179,AY179))","v":{"$error":"#REF!"}}]
["R20",1,"Factor_Interno","Tecnología","Desconocimiento de politcas de seguridad de la Informacion Institucionales","Irresponsabilidad y no confidencialidad en el manejo de la información ","Pérdida de credibilidad, alteración de la informacion",1,{"$f":"IF(H180=5,\"Mas de una vez al año\",IF(H180=4,\"Al menos una vez en el ultimo año\",IF(H180=3,\"Al menos una vez en los ultimos 2 años\",IF(H180=2,\"Al menos una vez en los ultimos 5 años\",\"No se ha presentado en los ultimos 5 años\"))))","v":"No se ha presentado en los ultimos 5 años"},{"$f":"CONCATENATE(H$180,K$180)","v":"15"},5,{"$f":"IF(K180=5,\"Catastrófico\",IF(K180=4,\"Mayor\",IF(K180=3,\"Moderado\",IF(K180=2,\"Menos\",IF(K180=1,\"Insignificante\",\"Digite Valor entre 1 y 5\")))))","v":"Catastrófico"},{"$f":"IF(L180=\"Digite Valor entre 1 y 5\",\"\",IF(COUNTIF(CE$10:CE$17,CONCATENATE(H180,K180)),CE$9,IF(COUNTIF(CF$10:CF$17,CONCATENATE(H180,K180)),CF$9,IF(COUNTIF(CG$10:CG$13,CONCATENATE(H180,K180)),CG$9,CH$9))))","v":"Zona de Riesgo Alta"},{"$f":"IF(M180=CE$9,\"E\",IF(M180=CF$9,\"A\",IF(M180=CG$9,\"M\",IF(M180=CH$9,\"B\",\"\"))))","v":"A"},"Control Preventivo","alertas del correo electronico institucional","Continuo","Afecta el Impacto","Si",15,"Si",5,"Si",15,"No",0,"Si",15,"Si",10,"Si",30,90,"Disminuye el Impacto en 2",2,{"$f":"BD180","v":1},{"$f":"IF(AJ180=5,\"Mas de una vez al año\",IF(AJ180=4,\"Al menos una vez en el ultimo año\",IF(AJ180=3,\"Al menos una vez en los ultimos 2 años\",IF(AJ180=2,\"Al menos una vez en los ultimos 5 años\",\"No se ha presentado en los ultimos 5 años\"))))","v":"No se ha presentado en los ultimos 5 años"},{"$f":"BF180","v":3},{"$f":"IF(AL180=5,\"Catastrófico - Tendría desastrosas consecuencias o efectos sobre la institución\",IF(AL180=4,\"Mayor - Tendría altas consecuencias o efectos sobre la institución\",IF(AL180=3,\"Moderado - Tendría medianas consecuencias o efectos sobre la institución\",IF(AL180=2,\"Menos - Tendría bajo impacto o efecto sobre la institución\",IF(AL180=1,\"Insignificante - tendría consecuencias o efectos mínimos en la institución\",\"Digite Valor entre 1 y 5\")))))","v":"Moderado - Tendría medianas consecuencias o efectos sobre la institución"},{"$f":"CONCATENATE(AJ180,AL180)","v":"13"},{"$f":"IF(COUNTIF($CE$10:$CE$17,AN180),$CE$9,IF(COUNTIF($CF$10:$CF$17,AN180),$CF$9,IF(COUNTIF($CG$10:$CG$13,AN180),$CG$9,IF(COUNTIF($CH$10:$CH$14,AN180),$CH$9,\"\"))))","v":"Zona de Riesgo Moderada"},{"$f":"IF(AO180=$CE$9,\"E\",IF(AO180=$CF$9,\"A\",IF(AO180=$CG$9,\"M\",IF(AO180=$CH$9,\"B\",\"\"))))","v":"M"},"Socializar la usabilidad de las alesrtas del correo electrónico","Monitoreo del sistema de correo electrónico","Coordinador de área de servidoress y servicios","2015-11-25","2016-12-25","registro de evidencias del sistema",1,{"$f":"IF(R180=\"Afecta la Probabilidad\",AW180-(AW180-AI180),\"No aplica\")","v":"No aplica"},5,2,{"$f":"IF([6]Matriz!R181=\"Afecta el Impacto\",CONCATENATE(AW180,AZ180),CONCATENATE(AX180,AY180))","v":{"$error":"#REF!"}},{"$f":"IF(R180=\"\",\"\",SUMIF(R180:R188,\"Afecta la Probabilidad\",AX180:AX188))","v":0},{"$f":"IF(R180=\"\",\"\",SUMIF(R180:R188,\"Afecta el Impacto\",AZ180:AZ188))","v":2},{"$f":"IF(BB180=\"\",\"\",IF(H180-BB180<=0,1,H180-BB180))","v":1},{"$f":"CONCATENATE(BD180,BF180)","v":"13"},{"$f":"IF(K180=\"\",\"\",IF(K180-BC180<0,1,K180-BC180))","v":3}]
[null,2,{"$nulls":4},"Utilización de la información con fines malisiosos o personales",{"$nulls":12},0,null,0,null,0,null,0,null,0,null,0,null,0,0,"",0,{"$nulls":14},{"$f":"IF(R181=\"Afecta la Probabilidad\",AW181-(AW181-AI181),\"No aplica\")","v":"No aplica"},null,"No aplica",{"$f":"IF([6]Matriz!R182=\"Afecta el Impacto\",CONCATENATE(AW181,AZ181),CONCATENATE(AX181,AY181))","v":{"$error":"#REF!"}}]
[null,3,"Factor_Interno",{"$nulls":3},"Mala Imagen Institucional",{"$nulls":12},0,null,0,null,0,null,0,null,0,null,0,null,0,0,"",0,{"$nulls":14},"No aplica",null,"No aplica",{"$f":"IF([6]Matriz!R183=\"Afecta el Impacto\",CONCATENATE(AW182,AZ182),CONCATENATE(AX182,AY182))","v":{"$error":"#REF!"}}]
[null,4,{"$nulls":4},"Inconformidad del Usuario",{"$nulls":12},0,null,0,null,0,null,0,null,0,null,0,null,0,0,"",0,{"$nulls":14},"No aplica",null,"No aplica"]
[null,5,{"$nulls":17},0,null,0,null,0,null,0,null,0,null,0,null,0,0,"",0,{"$nulls":14},"No aplica",null,"No aplica"]
[null,6,{"$nulls":17},0,null,0,null,0,null,0,null,0,null,0,null,0,0,"",0,{"$nulls":14},"No aplica",null,"No aplica"]
[null,7,{"$nulls":17},0,null,0,null,0,null,0,null,0,null,0,null,0,0,"",0,{"$nulls":14},"No aplica",null,"No aplica"]
[null,8,{"$nulls":17},0,null,0,null,0,null,0,null,0,null,0,null,0,0,"",0,{"$nulls":14},"No aplica",null,"No aplica"]
[null,9,{"$nulls":17},0,null,0,null,0,null,0,null,0,null,0,null,0,0,"",0,{"$nulls":14},"No aplica",null,"No aplica"]
["R21",1,"Factor_Interno","Personal","Entrada y salidad semestral del personal al área de Help Desk","Fuga de información (continuo ingreso y retiro de personal al área de HelpDesk)","Pérdida de la información ",5,{"$f":"IF(H189=5,\"Mas de una vez al año\",IF(H189=4,\"Al menos una vez en el ultimo año\",IF(H189=3,\"Al menos una vez en los ultimos 2 años\",IF(H189=2,\"Al menos una vez en los ultimos 5 años\",\"No se ha presentado en los ultimos 5 años\"))))","v":"Mas de una vez al año"},{"$f":"CONCATENATE(H$189,K$189)","v":"55"},5,{"$f":"IF(K189=5,\"Catastrófico\",IF(K189=4,\"Mayor\",IF(K189=3,\"Moderado\",IF(K189=2,\"Menos\",IF(K189=1,\"Insignificante\",\"Digite Valor entre 1 y 5\")))))","v":"Catastrófico"},{"$f":"IF(L189=\"Digite Valor entre 1 y 5\",\"\",IF(COUNTIF(CE$10:CE$17,CONCATENATE(H189,K189)),CE$9,IF(COUNTIF(CF$10:CF$17,CONCATENATE(H189,K189)),CF$9,IF(COUNTIF(CG$10:CG$13,CONCATENATE(H189,K189)),CG$9,CH$9))))","v":"Zona de Riesgo Extrema"},{"$f":"IF(M189=CE$9,\"E\",IF(M189=CF$9,\"A\",IF(M189=CG$9,\"M\",IF(M189=CH$9,\"B\",\"\"))))","v":"E"},"Control Preventivo","Verificación en el sistema Simca   (historia academica para potencializar la permanencia en el área)","Semestral","Afecta el Impacto","No",0,"Si",5,"No",0,"Si",10,"Si",15,"No",0,"No",0,30,"No disminuye el Impacto",0,{"$f":"BD189","v":5},{"$f":"IF(AJ189=5,\"Mas de una vez al año\",IF(AJ189=4,\"Al menos una vez en el ultimo año\",IF(AJ189=3,\"Al menos una vez en los ultimos 2 años\",IF(AJ189=2,\"Al menos una vez en los ultimos 5 años\",\"No se ha presentado en los ultimos 5 años\"))))","v":"Mas de una vez al año"},{"$f":"BF189","v":5},{"$f":"IF(AL189=5,\"Catastrófico - Tendría desastrosas consecuencias o efectos sobre la institución\",IF(AL189=4,\"Mayor - Tendría altas consecuencias o efectos sobre la institución\",IF(AL189=3,\"Moderado - Tendría medianas consecuencias o efectos sobre la institución\",IF(AL189=2,\"Menos - Tendría bajo impacto o efecto sobre la institución\",IF(AL189=1,\"Insignificante - tendría consecuencias o efectos mínimos en la institución\",\"Digite Valor entre 1 y 5\")))))","v":"Catastrófico - Tendría desastrosas consecuencias o efectos sobre la institución"},{"$f":"CONCATENATE(AJ189,AL189)","v":"55"},{"$f":"IF(COUNTIF($CE$10:$CE$17,AN189),$CE$9,IF(COUNTIF($CF$10:$CF$17,AN189),$CF$9,IF(COUNTIF($CG$10:$CG$13,AN189),$CG$9,IF(COUNTIF($CH$10:$CH$14,AN189),$CH$9,\"\"))))","v":"Zona de Riesgo Extrema"},{"$f":"IF(AO189=$CE$9,\"E\",IF(AO189=$CF$9,\"A\",IF(AO189=$CG$9,\"M\",IF(AO189=$CH$9,\"B\",\"\"))))","v":"E"},"Documentar la aplicabilidad del control","Mejoramiento del procedimiento de vinculacionde monitores ","coordinadores de área","2015-11-25","2016-07-25","registro de evidencias en las acciones de mejora, actualizacion de procedimiento de vinculacion de monitores",5,"No aplica",5,0,null,{"$f":"IF(R189=\"\",\"\",SUMIF(R189:R197,\"Afecta la Probabilidad\",AX189:AX197))","v":0},{"$f":"IF(R189=\"\",\"\",SUMIF(R189:R197,\"Afecta el Impacto\",AZ189:AZ197))","v":0},{"$f":"IF(BB189=\"\",\"\",IF(H189-BB189<=0,1,H189-BB189))","v":5},{"$f":"CONCATENATE(BD189,BF189)","v":"55"},{"$f":"IF(K189=\"\",\"\",IF(K189-BC189<0,1,K189-BC189))","v":5}]
[null,2,null,null,"Falta de acuerdos de confidencialidad",null,"Pérdida de confianza Institucional",{"$nulls":12},0,null,0,null,0,null,0,null,0,null,0,null,0,0,{"$f":"IF(R190=\"\",\"\",IF(R190=\"Afecta la Probabilidad\",IF(AND(AG190>=0,AG190<=50),\"No disminuye la Probabilidad\",IF(AND(AG190>50,AG190<=75),\"Disminuye la Probabilidad en 1\",IF(AND(AG190>75,AG190<=100),\"Disminuye la Probabilidad en 2\",\"\"))),IF(AND(AG190>=0,AG190<=50),\"No disminuye el Impacto\",IF(AND(AG190>50,AG190<=75),\"Disminuye el Impacto en 1\",IF(AND(AG190>75,AG190<=100),\"Disminuye el Impacto en 2\",\"\")))))","v":""},0,{"$nulls":14},"No aplica",null,"No aplica"]
[null,3,{"$nulls":17},0,null,0,null,0,null,0,null,0,null,0,null,0,0,{"$f":"IF(R191=\"\",\"\",IF(R191=\"Afecta la Probabilidad\",IF(AND(AG191>=0,AG191<=50),\"No disminuye la Probabilidad\",IF(AND(AG191>50,AG191<=75),\"Disminuye la Probabilidad en 1\",IF(AND(AG191>75,AG191<=100),\"Disminuye la Probabilidad en 2\",\"\"))),IF(AND(AG191>=0,AG191<=50),\"No disminuye el Impacto\",IF(AND(AG191>50,AG191<=75),\"Disminuye el Impacto en 1\",IF(AND(AG191>75,AG191<=100),\"Disminuye el Impacto en 2\",\"\")))))","v":""},0,{"$nulls":14},"No aplica",null,"No aplica"]
[null,4,{"$nulls":17},0,null,0,null,0,null,0,null,0,null,0,null,0,0,{"$f":"IF(R192=\"\",\"\",IF(R192=\"Afecta la Probabilidad\",IF(AND(AG192>=0,AG192<=50),\"No disminuye la Probabilidad\",IF(AND(AG192>50,AG192<=75),\"Disminuye la Probabilidad en 1\",IF(AND(AG192>75,AG192<=100),\"Disminuye la Probabilidad en 2\",\"\"))),IF(AND(AG192>=0,AG192<=50),\"No disminuye el Impacto\",IF(AND(AG192>50,AG192<=75),\"Disminuye el Impacto en 1\",IF(AND(AG192>75,AG192<=100),\"Disminuye el Impacto en 2\",\"\")))))","v":""},0,{"$nulls":14},"No aplica",null,"No aplica"]
[null,5,{"$nulls":17},0,null,0,null,0,null,0,null,0,null,0,null,0,0,{"$f":"IF(R193=\"\",\"\",IF(R193=\"Afecta la Probabilidad\",IF(AND(AG193>=0,AG193<=50),\"No disminuye la Probabilidad\",IF(AND(AG193>50,AG193<=75),\"Disminuye la Probabilidad en 1\",IF(AND(AG193>75,AG193<=100),\"Disminuye la Probabilidad en 2\",\"\"))),IF(AND(AG193>=0,AG193<=50),\"No disminuye el Impacto\",IF(AND(AG193>50,AG193<=75),\"Disminuye el Impacto en 1\",IF(AND(AG193>75,AG193<=100),\"Disminuye el Impacto en 2\",\"\")))))","v":""},0,{"$nulls":14},"No aplica",null,"No aplica"]
[null,6,{"$nulls":17},0,null,0,null,0,null,0,null,0,null,0,null,0,0,"",0,{"$nulls":14},"No aplica",null,"No aplica"]
[null,7,{"$nulls":17},0,null,0,null,0,null,0,null,0,null,0,null,0,0,"",0,{"$nulls":14},"No aplica",null,"No aplica"]
[null,8,{"$nulls":17},0,null,0,null,0,null,0,null,0,null,0,null,0,0,"",0,{"$nulls":14},"No aplica",null,"No aplica"]
[null,9,{"$nulls":17},0,null,0,null,0,null,0,null,0,null,0,null,0,0,"",0,{"$nulls":14},"No aplica",null,"No aplica"]
["R22",1,"Factor_Interno","Procesos","Ausencia de Mantenimiento al Sitema Biométrico","Acceso físico sin control de cualquier persona a las instalaciones  de la División TIC","Robo de recursos tecnológicos",4,{"$f":"IF(H198=5,\"Mas de una vez al año\",IF(H198=4,\"Al menos una vez en el ultimo año\",IF(H198=3,\"Al menos una vez en los ultimos 2 años\",IF(H198=2,\"Al menos una vez en los ultimos 5 años\",\"No se ha presentado en los ultimos 5 años\"))))","v":"Al menos una vez en el ultimo año"},{"$f":"CONCATENATE(H$198,K$198)","v":"45"},5,{"$f":"IF(K198=5,\"Catastrófico\",IF(K198=4,\"Mayor\",IF(K198=3,\"Moderado\",IF(K198=2,\"Menos\",IF(K198=1,\"Insignificante\",\"Digite Valor entre 1 y 5\")))))","v":"Catastrófico"},{"$f":"IF(L198=\"Digite Valor entre 1 y 5\",\"\",IF(COUNTIF(CE$10:CE$17,CONCATENATE(H198,K198)),CE$9,IF(COUNTIF(CF$10:CF$17,CONCATENATE(H198,K198)),CF$9,IF(COUNTIF(CG$10:CG$13,CONCATENATE(H198,K198)),CG$9,CH$9))))","v":"Zona de Riesgo Extrema"},"E","Control Preventivo","Activación del Contratode Mantenimiento de control de Acceso","Continuo","Afecta la Probabilidad","No",0,"Si",5,"No",0,"Si",10,"Si",15,"Si",10,"Si",{"$f":"IF(AE198=\"Si\",30,0)","v":30},70,{"$f":"IF(R198=\"\",\"\",IF(R198=\"Afecta la Probabilidad\",IF(AND(AG198>=0,AG198<=50),\"No disminuye la Probabilidad\",IF(AND(AG198>50,AG198<=75),\"Disminuye la Probabilidad en 1\",IF(AND(AG198>75,AG198<=100),\"Disminuye la Probabilidad en 2\",\"\"))),IF(AND(AG198>=0,AG198<=50),\"No disminuye el Impacto\",IF(AND(AG198>50,AG198<=75),\"Disminuye el Impacto en 1\",IF(AND(AG198>75,AG198<=100),\"Disminuye el Impacto en 2\",\"\")))))","v":"Disminuye la Probabilidad en 1"},{"$f":"IF(AG198<=50,0,IF(AND(AG198>50,AG198<=75),1,IF(AND(AG198>75,AG198<=100),2,\"\")))","v":1},{"$f":"BD198","v":1},{"$f":"IF(AJ198=5,\"Mas de una vez al año\",IF(AJ198=4,\"Al menos una vez en el ultimo año\",IF(AJ198=3,\"Al menos una vez en los ultimos 2 años\",IF(AJ198=2,\"Al menos una vez en los ultimos 5 años\",\"No se ha presentado en los ultimos 5 años\"))))","v":"No se ha presentado en los ultimos 5 años"},{"$f":"BF198","v":5},{"$f":"IF(AL198=5,\"Catastrófico - Tendría desastrosas consecuencias o efectos sobre la institución\",IF(AL198=4,\"Mayor - Tendría altas consecuencias o efectos sobre la institución\",IF(AL198=3,\"Moderado - Tendría medianas consecuencias o efectos sobre la institución\",IF(AL198=2,\"Menos - Tendría bajo impacto o efecto sobre la institución\",IF(AL198=1,\"Insignificante - tendría consecuencias o efectos mínimos en la institución\",\"Digite Valor entre 1 y 5\")))))","v":"Catastrófico - Tendría desastrosas consecuencias o efectos sobre la institución"},{"$f":"CONCATENATE(AJ198,AL198)","v":"15"},{"$f":"IF(COUNTIF($CE$10:$CE$17,AN198),$CE$9,IF(COUNTIF($CF$10:$CF$17,AN198),$CF$9,IF(COUNTIF($CG$10:$CG$13,AN198),$CG$9,IF(COUNTIF($CH$10:$CH$14,AN198),$CH$9,\"\"))))","v":"Zona de Riesgo Alta"},{"$f":"IF(AO198=$CE$9,\"E\",IF(AO198=$CF$9,\"A\",IF(AO198=$CG$9,\"M\",IF(AO198=$CH$9,\"B\",\"\"))))","v":"A"},"Actualmente no existe Contrat de Mantenimiento","Solicitar la reactivación del contrato de Mantenimiento de Sitema de Acceso a la Universidad","Jefe Div TIC, Vicerrectoría Administrativa","2016-01-01","2016-12-31","Solitud, CDP",{"$f":"H198","v":4},{"$f":"IF(R198=\"Afecta la Probabilidad\",AW198-(AW198-AI198),\"No aplica\")","v":1},{"$f":"K198","v":5},"No aplica",{"$f":"IF([7]Matriz!R198=\"Afecta el Impacto\",CONCATENATE(AW198,AZ198),CONCATENATE(AX198,AY198))","v":{"$error":"#REF!"}},{"$f":"IF(R198=\"\",\"\",SUMIF(R198:R206,\"Afecta la Probabilidad\",AX198:AX206))","v":3},{"$f":"IF(R198=\"\",\"\",SUMIF(R198:R206,\"Afecta el Impacto\",AZ198:AZ206))","v":0},{"$f":"IF(BB198=\"\",\"\",IF(H198-BB198<=0,1,H198-BB198))","v":1},{"$f":"CONCATENATE(BD198,BF198)","v":"15"},{"$f":"IF(K198=\"\",\"\",IF(K198-BC198<0,1,K198-BC198))","v":5}]
[null,2,"Factor_Externo","Tecnología","Falla en el suministro Eléctrico",null,"Pérdida de Información",{"$nulls":7},"Control Preventivo","Ajustes a la Puerta de Acceso a la Div TIC","Bimensual","Afecta la Probabilidad","No",0,"Si",5,"No",0,"Si",10,"Si",15,"Si",10,"Si",{"$f":"IF(AE199=\"Si\",30,0)","v":30},70,{"$f":"IF(R199=\"\",\"\",IF(R199=\"Afecta la Probabilidad\",IF(AND(AG199>=0,AG199<=50),\"No disminuye la Probabilidad\",IF(AND(AG199>50,AG199<=75),\"Disminuye la Probabilidad en 1\",IF(AND(AG199>75,AG199<=100),\"Disminuye la Probabilidad en 2\",\"\"))),IF(AND(AG199>=0,AG199<=50),\"No disminuye el Impacto\",IF(AND(AG199>50,AG199<=75),\"Disminuye el Impacto en 1\",IF(AND(AG199>75,AG199<=100),\"Disminuye el Impacto en 2\",\"\")))))","v":"Disminuye la Probabilidad en 1"},{"$f":"IF(AG199<=50,0,IF(AND(AG199>50,AG199<=75),1,IF(AND(AG199>75,AG199<=100),2,\"\")))","v":1},{"$nulls":7},"Ya se hizo el Ajuste de la Puerat el 25 de Noviembre de 2015","Solicitar el Ajuste de la Puerta","Jefe Div TIC, DAS","2015-02-01","Indefinido","Solicitud",null,{"$f":"IF(R199=\"Afecta la Probabilidad\",AW199-(AW199-AI199),\"No aplica\")","v":1},null,"No aplica",{"$f":"IF([7]Matriz!R199=\"Afecta el Impacto\",CONCATENATE(AW199,AZ199),CONCATENATE(AX199,AY199))","v":{"$error":"#REF!"}}]
[null,3,"Factor_Interno","Operacional","Desactivación del Control Biométrico mediante la Palanca de control de Pánico",null,"Toma del Data Center",{"$nulls":7},"Control Preventivo","Sensibilización del Control de Acceso a los funcionarios de la Div TIC","Semestral","Afecta la Probabilidad","Si",15,"Si",5,"No",0,"Si",10,"Si",15,"No",0,"Si",30,75,{"$f":"IF(R200=\"\",\"\",IF(R200=\"Afecta la Probabilidad\",IF(AND(AG200>=0,AG200<=50),\"No disminuye la Probabilidad\",IF(AND(AG200>50,AG200<=75),\"Disminuye la Probabilidad en 1\",IF(AND(AG200>75,AG200<=100),\"Disminuye la Probabilidad en 2\",\"\"))),IF(AND(AG200>=0,AG200<=50),\"No disminuye el Impacto\",IF(AND(AG200>50,AG200<=75),\"Disminuye el Impacto en 1\",IF(AND(AG200>75,AG200<=100),\"Disminuye el Impacto en 2\",\"\")))))","v":"Disminuye la Probabilidad en 1"},1,{"$nulls":8},"Realizar jornadas de sensibilización","Jefe Div TIC","2016-01-01","Indefinido","Asistencia",null,{"$f":"IF(R200=\"Afecta la Probabilidad\",AW200-(AW200-AI200),\"No aplica\")","v":1},null,"No aplica",{"$f":"IF([7]Matriz!R200=\"Afecta el Impacto\",CONCATENATE(AW200,AZ200),CONCATENATE(AX200,AY200))","v":{"$error":"#REF!"}}]
[null,4,"Factor_Interno","Operacional","Fragilidad de la Puerta (Triplex)",null,"Acceso a la Información sensible a través de las terminales de los funcionarios Líderes Ténicos (Aplicaciones, Bases de Datos)",{"$nulls":12},{"$f":"IF(S201=\"Si\",15,0)","v":0},null,{"$f":"IF(U201=\"Si\",5,0)","v":0},null,{"$f":"IF(W201=\"Si\",15,0)","v":0},null,{"$f":"IF(Y201=\"Si\",10,0)","v":0},null,{"$f":"IF(AA201=\"Si\",15,0)","v":0},null,{"$f":"IF(AC201=\"Si\",10,0)","v":0},null,0,0,{"$f":"IF(R201=\"\",\"\",IF(R201=\"Afecta la Probabilidad\",IF(AND(AG201>=0,AG201<=50),\"No disminuye la Probabilidad\",IF(AND(AG201>50,AG201<=75),\"Disminuye la Probabilidad en 1\",IF(AND(AG201>75,AG201<=100),\"Disminuye la Probabilidad en 2\",\"\"))),IF(AND(AG201>=0,AG201<=50),\"No disminuye el Impacto\",IF(AND(AG201>50,AG201<=75),\"Disminuye el Impacto en 1\",IF(AND(AG201>75,AG201<=100),\"Disminuye el Impacto en 2\",\"\")))))","v":""},0,{"$nulls":14},"No aplica",null,{"$f":"IF(R201=\"Afecta el Impacto\",AY201-(AY201-AI201),\"No aplica\")","v":"No aplica"},{"$f":"IF([7]Matriz!R201=\"Afecta el Impacto\",CONCATENATE(AW201,AZ201),CONCATENATE(AX201,AY201))","v":{"$error":"#REF!"}}]
[null,5,"Factor_Interno","Operacional","No Control de Llaves",{"$nulls":14},0,null,0,null,0,null,0,null,0,null,0,null,0,0,"",0,{"$nulls":14},"No aplica",null,"No aplica",{"$f":"IF([7]Matriz!R202=\"Afecta el Impacto\",CONCATENATE(AW202,AZ202),CONCATENATE(AX202,AY202))","v":{"$error":"#REF!"}}]
[null,6,"Factor_Interno","Tecnología"," No Mantenimiento de la Cámara",{"$nulls":14},0,null,0,null,0,null,0,null,0,null,0,null,0,0,"",0,{"$nulls":14},"No aplica",null,"No aplica"]
[null,7,"Factor_Interno","Tecnología","Falla en el NVR (Imágenes)",{"$nulls":14},0,null,0,null,0,null,0,null,0,null,0,null,0,0,"",0,{"$nulls":14},"No aplica",null,"No aplica"]
[null,8,"Factor_Interno","Operacional","Ausencia en el puesto de trabajo de la secretaría",{"$nulls":14},0,null,0,null,0,null,0,null,0,null,0,null,0,0,"",0,{"$nulls":14},"No aplica",null,"No aplica"]
[null,9,"Factor_Interno","Operacional","Irresponsabilidad operativa",{"$nulls":14},0,null,0,null,0,null,0,null,0,null,0,null,0,0,"",0,{"$nulls":14},"No aplica",null,"No aplica",{"$f":"IF([7]Matriz!R206=\"Afecta el Impacto\",CONCATENATE(AW206,AZ206),CONCATENATE(AX206,AY206))","v":{"$error":"#REF!"}}]
["R23",1,"Factor_Externo","Procesos","Ineficiente estudio del Mercado de dichos poductos software","Adquisición de Aplicaciones Informáticas de Mala Calidad","Incompatibilidad con las Aplicaciones y Bases de Dattos existentes",3,{"$f":"IF(H207=5,\"Mas de una vez al año\",IF(H207=4,\"Al menos una vez en el ultimo año\",IF(H207=3,\"Al menos una vez en los ultimos 2 años\",IF(H207=2,\"Al menos una vez en los ultimos 5 años\",\"No se ha presentado en los ultimos 5 años\"))))","v":"Al menos una vez en los ultimos 2 años"},{"$f":"CONCATENATE(H$207,K$207)","v":"34"},4,{"$f":"IF(K207=5,\"Catastrófico\",IF(K207=4,\"Mayor\",IF(K207=3,\"Moderado\",IF(K207=2,\"Menos\",IF(K207=1,\"Insignificante\",\"Digite Valor entre 1 y 5\")))))","v":"Mayor"},{"$f":"IF(L207=\"Digite Valor entre 1 y 5\",\"\",IF(COUNTIF(CE$10:CE$17,CONCATENATE(H207,K207)),CE$9,IF(COUNTIF(CF$10:CF$17,CONCATENATE(H207,K207)),CF$9,IF(COUNTIF(CG$10:CG$13,CONCATENATE(H207,K207)),CG$9,CH$9))))","v":"Zona de Riesgo Extrema"},"E","Control Preventivo","Adecuado Estudo de Mercado","A Solicitud","Afecta la Probabilidad","No",0,"Si",5,"No",0,"Si",10,"Si",15,"Si",10,"Si",30,70,"Disminuye la Probabilidad en 1",1,{"$f":"BD207","v":1},{"$f":"IF(AJ207=5,\"Mas de una vez al año\",IF(AJ207=4,\"Al menos una vez en el ultimo año\",IF(AJ207=3,\"Al menos una vez en los ultimos 2 años\",IF(AJ207=2,\"Al menos una vez en los ultimos 5 años\",\"No se ha presentado en los ultimos 5 años\"))))","v":"No se ha presentado en los ultimos 5 años"},{"$f":"BF207","v":4},{"$f":"IF(AL207=5,\"Catastrófico - Tendría desastrosas consecuencias o efectos sobre la institución\",IF(AL207=4,\"Mayor - Tendría altas consecuencias o efectos sobre la institución\",IF(AL207=3,\"Moderado - Tendría medianas consecuencias o efectos sobre la institución\",IF(AL207=2,\"Menos - Tendría bajo impacto o efecto sobre la institución\",IF(AL207=1,\"Insignificante - tendría consecuencias o efectos mínimos en la institución\",\"Digite Valor entre 1 y 5\")))))","v":"Mayor - Tendría altas consecuencias o efectos sobre la institución"},{"$f":"CONCATENATE(AJ207,AL207)","v":"14"},{"$f":"IF(COUNTIF($CE$10:$CE$17,AN207),$CE$9,IF(COUNTIF($CF$10:$CF$17,AN207),$CF$9,IF(COUNTIF($CG$10:$CG$13,AN207),$CG$9,IF(COUNTIF($CH$10:$CH$14,AN207),$CH$9,\"\"))))","v":"Zona de Riesgo Alta"},{"$f":"IF(AO207=$CE$9,\"E\",IF(AO207=$CF$9,\"A\",IF(AO207=$CG$9,\"M\",IF(AO207=$CH$9,\"B\",\"\"))))","v":"A"},"Siempre se hace","Realizar Estduios de Mecado respectivos","Jefe Div TIC y Jefe Dependencia respectiva","2016-01-01","Idefinido","Documentos",{"$f":"H207","v":3},{"$f":"IF(R207=\"Afecta la Probabilidad\",AW207-(AW207-AI207),\"No aplica\")","v":1},{"$f":"K207","v":4},"No aplica",{"$f":"IF([7]Matriz!R207=\"Afecta el Impacto\",CONCATENATE(AW207,AZ207),CONCATENATE(AX207,AY207))","v":{"$error":"#REF!"}},{"$f":"IF(R207=\"\",\"\",SUMIF(R207:R215,\"Afecta la Probabilidad\",AX207:AX215))","v":4},{"$f":"IF(R207=\"\",\"\",SUMIF(R207:R215,\"Afecta el Impacto\",AZ207:AZ215))","v":0},{"$f":"IF(BB207=\"\",\"\",IF(H207-BB207<=0,1,H207-BB207))","v":1},{"$f":"CONCATENATE(BD207,BF207)","v":"14"},{"$f":"IF(K207=\"\",\"\",IF(K207-BC207<0,1,K207-BC207))","v":4}]
[null,2,"Factor_Externo","Imagen","Baja Trayectoria del Proveedor",null,"No funcionalidad de las Aplicaciones en las respectivas Dependencias",{"$nulls":7},"Control Preventivo","Interacción con los Proveedores","A Solicitud","Afecta la Probabilidad","No",0,"Si",5,"No",0,"Si",10,"Si",15,"Si",10,"Si",30,70,"Disminuye la Probabilidad en 1",1,{"$nulls":7},"Siempre se hace","Interactuar con los Proveedores","Jefe Div TIC y Jefe Dependencia respectiva",null,"Idefinido","Presentacione en Power Point",null,{"$f":"IF(R208=\"Afecta la Probabilidad\",AW208-(AW208-AI208),\"No aplica\")","v":1},null,"No aplica",{"$f":"IF([7]Matriz!R208=\"Afecta el Impacto\",CONCATENATE(AW208,AZ208),CONCATENATE(AX208,AY208))","v":{"$error":"#REF!"}}]
[null,3,"Factor_Interno","Tecnología","Ausencia de un Plan de Soporte, Actulalización y Mantenimiento ",null,"Traumatismos en los procesos institucionales",{"$nulls":7},"Control Preventivo","Demo de la Aplicación en situ para pruebas Tecnicas y Fucionales","A Solicitud","Afecta la Probabilidad","No",0,"Si",5,"No",0,"Si",10,"Si",15,"Si",10,"Si",30,70,"Disminuye la Probabilidad en 1",1,{"$nulls":7},"Siempre se hace","Solitar un Demo","Jefe Div TIC y Jefe Dependencia respectiva",null,"Idefinido","Aplicactivo Demo",null,1,null,"No aplica",{"$f":"IF([7]Matriz!R209=\"Afecta el Impacto\",CONCATENATE(AW209,AZ209),CONCATENATE(AX209,AY209))","v":{"$error":"#REF!"}}]
[null,4,"Factor_Interno","Tecnología","Ineficiente evaluación Técnica",null,"Inconformidad de la comunidad universitaria y soociedad ",{"$nulls":7},"Control Preventivo","Concepto Técnico y Concepto Funcional","A Solicitud","Afecta la Probabilidad","No",0,"Si",5,"No",0,"Si",10,null,0,"Si",10,"Si",30,55,"Disminuye la Probabilidad en 1",1,{"$nulls":7},"Siempre se hace","Emitir Conceptos","Jefe Div TIC y Jefe Dependencia respectiva",null,"Idefinido","Documentos",null,1,null,"No aplica",{"$f":"IF([7]Matriz!R210=\"Afecta el Impacto\",CONCATENATE(AW210,AZ210),CONCATENATE(AX210,AY210))","v":{"$error":"#REF!"}}]
[null,5,"Factor_Interno","Tecnología","Ineficiente Evaluación Funcional",{"$nulls":14},0,null,0,null,0,null,0,null,0,null,0,null,0,{"$f":"T211+V211+X211+Z211+AB211+AD211+AF211","v":0},"",0,{"$nulls":14},"No aplica",null,"No aplica",{"$f":"IF([7]Matriz!R211=\"Afecta el Impacto\",CONCATENATE(AW211,AZ211),CONCATENATE(AX211,AY211))","v":{"$error":"#REF!"}}]
[null,6,{"$nulls":17},0,null,0,null,0,null,0,null,0,null,0,null,0,0,"",0,{"$nulls":14},"No aplica",null,"No aplica",{"$f":"IF([7]Matriz!R212=\"Afecta el Impacto\",CONCATENATE(AW212,AZ212),CONCATENATE(AX212,AY212))","v":{"$error":"#REF!"}}]
[null,7,{"$nulls":17},0,null,0,null,0,null,0,null,0,null,0,null,0,0,"",0,{"$nulls":14},"No aplica",null,"No aplica",{"$f":"IF([7]Matriz!R213=\"Afecta el Impacto\",CONCATENATE(AW213,AZ213),CONCATENATE(AX213,AY213))","v":{"$error":"#REF!"}}]
[null,8,{"$nulls":17},0,null,0,null,0,null,0,null,0,null,0,null,0,0,"",0,{"$nulls":14},"No aplica",null,"No aplica",{"$f":"IF([7]Matriz!R214=\"Afecta el Impacto\",CONCATENATE(AW214,AZ214),CONCATENATE(AX214,AY214))","v":{"$error":"#REF!"}}]
[null,9,{"$nulls":17},0,null,0,null,0,null,0,null,0,null,0,null,0,0,"",0,{"$nulls":14},"No aplica",null,"No aplica",{"$f":"IF([7]Matriz!R215=\"Afecta el Impacto\",CONCATENATE(AW215,AZ215),CONCATENATE(AX215,AY215))","v":{"$error":"#REF!"}}]
["R24",1,"Factor_Interno","Procesos","Ineficiente proceso de selección y evaluación de Hoja de Vida y Entrevista","Vinculación de Monitores sin ética personal y profesional","Pérdida de la Seguridad de la Información en los Sistemas y en las Redes",3,{"$f":"IF(H216=5,\"Mas de una vez al año\",IF(H216=4,\"Al menos una vez en el ultimo año\",IF(H216=3,\"Al menos una vez en los ultimos 2 años\",IF(H216=2,\"Al menos una vez en los ultimos 5 años\",\"No se ha presentado en los ultimos 5 años\"))))","v":"Al menos una vez en los ultimos 2 años"},{"$f":"CONCATENATE(H$216,K$216)","v":"35"},5,{"$f":"IF(K216=5,\"Catastrófico\",IF(K216=4,\"Mayor\",IF(K216=3,\"Moderado\",IF(K216=2,\"Menos\",IF(K216=1,\"Insignificante\",\"Digite Valor entre 1 y 5\")))))","v":"Catastrófico"},"Zona de Riesgo Extrema",{"$f":"IF(M216=CE$9,\"E\",IF(M216=CF$9,\"A\",IF(M216=CG$9,\"M\",IF(M216=CH$9,\"B\",\"\"))))","v":"E"},"Control Preventivo","Estudio de Hoja de Vida","Semestral","Afecta la Probabilidad","Si",15,"Si",5,"No",0,"Si",10,"Si",15,"Si",10,"Si",30,85,"Disminuye la Probabilidad en 2",2,{"$f":"BD216","v":1},{"$f":"IF(AJ216=5,\"Mas de una vez al año\",IF(AJ216=4,\"Al menos una vez en el ultimo año\",IF(AJ216=3,\"Al menos una vez en los ultimos 2 años\",IF(AJ216=2,\"Al menos una vez en los ultimos 5 años\",\"No se ha presentado en los ultimos 5 años\"))))","v":"No se ha presentado en los ultimos 5 años"},{"$f":"BF216","v":5},{"$f":"IF(AL216=5,\"Catastrófico - Tendría desastrosas consecuencias o efectos sobre la institución\",IF(AL216=4,\"Mayor - Tendría altas consecuencias o efectos sobre la institución\",IF(AL216=3,\"Moderado - Tendría medianas consecuencias o efectos sobre la institución\",IF(AL216=2,\"Menos - Tendría bajo impacto o efecto sobre la institución\",IF(AL216=1,\"Insignificante - tendría consecuencias o efectos mínimos en la institución\",\"Digite Valor entre 1 y 5\")))))","v":"Catastrófico - Tendría desastrosas consecuencias o efectos sobre la institución"},{"$f":"CONCATENATE(AJ216,AL216)","v":"15"},{"$f":"IF(COUNTIF($CE$10:$CE$17,AN216),$CE$9,IF(COUNTIF($CF$10:$CF$17,AN216),$CF$9,IF(COUNTIF($CG$10:$CG$13,AN216),$CG$9,IF(COUNTIF($CH$10:$CH$14,AN216),$CH$9,\"\"))))","v":"Zona de Riesgo Alta"},{"$f":"IF(AO216=$CE$9,\"E\",IF(AO216=$CF$9,\"A\",IF(AO216=$CG$9,\"M\",IF(AO216=$CH$9,\"B\",\"\"))))","v":"A"},null,"Mejorar el Proceso de Evaluación de Hoja de Vida y Entrevista","Coordinadorde Area","2016-01-01","Indefinido","Esquema de Evaluación",3,2,5,"No aplica",{"$f":"IF([7]Matriz!R216=\"Afecta el Impacto\",CONCATENATE(AW216,AZ216),CONCATENATE(AX216,AY216))","v":{"$error":"#REF!"}},{"$f":"IF(R216=\"\",\"\",SUMIF(R216:R224,\"Afecta la Probabilidad\",AX216:AX224))","v":6},{"$f":"IF(R216=\"\",\"\",SUMIF(R216:R224,\"Afecta el Impacto\",AZ216:AZ224))","v":0},{"$f":"IF(BB216=\"\",\"\",IF(H216-BB216<=0,1,H216-BB216))","v":1},{"$f":"CONCATENATE(BD216,BF216)","v":"15"},{"$f":"IF(K216=\"\",\"\",IF(K216-BC216<0,1,K216-BC216))","v":5}]
[null,2,"Factor_Interno","Personal","Falta de  apoyo Sicológico ",null,"Uso indebido de la Información para beneficio personal o de terceros",{"$nulls":7},"Control Preventivo","Entrevista","Semestral","Afecta la Probabilidad","Si",15,"Si",5,"No",0,"Si",10,"Si",15,"Si",10,"Si",30,85,{"$f":"IF(R217=\"\",\"\",IF(R217=\"Afecta la Probabilidad\",IF(AND(AG217>=0,AG217<=50),\"No disminuye la Probabilidad\",IF(AND(AG217>50,AG217<=75),\"Disminuye la Probabilidad en 1\",IF(AND(AG217>75,AG217<=100),\"Disminuye la Probabilidad en 2\",\"\"))),IF(AND(AG217>=0,AG217<=50),\"No disminuye el Impacto\",IF(AND(AG217>50,AG217<=75),\"Disminuye el Impacto en 1\",IF(AND(AG217>75,AG217<=100),\"Disminuye el Impacto en 2\",\"\")))))","v":"Disminuye la Probabilidad en 2"},2,{"$nulls":8},"Solicitar apoyo de un Sicólogo a la Dependencia de Salud Integral","Jefe DivTIC, Jefe Salud Integral","2016-01-01","2016-12-01","Solicitud",null,2,null,"No aplica",{"$f":"IF([7]Matriz!R217=\"Afecta el Impacto\",CONCATENATE(AW217,AZ217),CONCATENATE(AX217,AY217))","v":{"$error":"#REF!"}}]
[null,3,"Factor_Interno","Comunicación interna","Falta de seguimiento al desarrollo de las actividades de los monitores ",null,"Pérdida de la confianza de la comunidad universitaria y sociedad",{"$nulls":7},"Control Preventivo","Prueba Escrita y Práctica","Semestral","Afecta la Probabilidad","Si",15,"Si",5,"No",0,"Si",10,"Si",15,"Si",10,"Si",30,85,{"$f":"IF(R218=\"\",\"\",IF(R218=\"Afecta la Probabilidad\",IF(AND(AG218>=0,AG218<=50),\"No disminuye la Probabilidad\",IF(AND(AG218>50,AG218<=75),\"Disminuye la Probabilidad en 1\",IF(AND(AG218>75,AG218<=100),\"Disminuye la Probabilidad en 2\",\"\"))),IF(AND(AG218>=0,AG218<=50),\"No disminuye el Impacto\",IF(AND(AG218>50,AG218<=75),\"Disminuye el Impacto en 1\",IF(AND(AG218>75,AG218<=100),\"Disminuye el Impacto en 2\",\"\")))))","v":"Disminuye la Probabilidad en 2"},2,{"$nulls":8},"Seguimiento a las actividades desarrolladas por los Monitores","Coordinador de Area","2016-03-01","2016-12-01","Bitácora de Actividades Desarrolldas",null,2,null,"No aplica",{"$f":"IF([7]Matriz!R218=\"Afecta el Impacto\",CONCATENATE(AW218,AZ218),CONCATENATE(AX218,AY218))","v":{"$error":"#REF!"}}]
[null,4,{"$nulls":17},0,null,0,null,0,null,0,null,0,null,0,null,0,0,{"$f":"IF(R219=\"\",\"\",IF(R219=\"Afecta la Probabilidad\",IF(AND(AG219>=0,AG219<=50),\"No disminuye la Probabilidad\",IF(AND(AG219>50,AG219<=75),\"Disminuye la Probabilidad en 1\",IF(AND(AG219>75,AG219<=100),\"Disminuye la Probabilidad en 2\",\"\"))),IF(AND(AG219>=0,AG219<=50),\"No disminuye el Impacto\",IF(AND(AG219>50,AG219<=75),\"Disminuye el Impacto en 1\",IF(AND(AG219>75,AG219<=100),\"Disminuye el Impacto en 2\",\"\")))))","v":""},0,{"$nulls":14},"No aplica",null,"No aplica",{"$f":"IF([7]Matriz!R219=\"Afecta el Impacto\",CONCATENATE(AW219,AZ219),CONCATENATE(AX219,AY219))","v":{"$error":"#REF!"}}]
[null,5,{"$nulls":17},0,null,0,null,0,null,0,null,0,null,0,null,0,0,{"$f":"IF(R220=\"\",\"\",IF(R220=\"Afecta la Probabilidad\",IF(AND(AG220>=0,AG220<=50),\"No disminuye la Probabilidad\",IF(AND(AG220>50,AG220<=75),\"Disminuye la Probabilidad en 1\",IF(AND(AG220>75,AG220<=100),\"Disminuye la Probabilidad en 2\",\"\"))),IF(AND(AG220>=0,AG220<=50),\"No disminuye el Impacto\",IF(AND(AG220>50,AG220<=75),\"Disminuye el Impacto en 1\",IF(AND(AG220>75,AG220<=100),\"Disminuye el Impacto en 2\",\"\")))))","v":""},0,{"$nulls":14},"No aplica",null,"No aplica",{"$f":"IF([7]Matriz!R220=\"Afecta el Impacto\",CONCATENATE(AW220,AZ220),CONCATENATE(AX220,AY220))","v":{"$error":"#REF!"}}]
[null,6,{"$nulls":17},0,null,0,null,0,null,0,null,0,null,0,null,0,0,"",0,{"$nulls":14},"No aplica",null,"No aplica",{"$f":"IF([7]Matriz!R221=\"Afecta el Impacto\",CONCATENATE(AW221,AZ221),CONCATENATE(AX221,AY221))","v":{"$error":"#REF!"}}]
[null,7,{"$nulls":17},0,null,0,null,0,null,0,null,0,null,0,null,0,0,"",0,{"$nulls":14},"No aplica",null,"No aplica",{"$f":"IF([7]Matriz!R222=\"Afecta el Impacto\",CONCATENATE(AW222,AZ222),CONCATENATE(AX222,AY222))","v":{"$error":"#REF!"}}]
[null,8,{"$nulls":17},0,null,0,null,0,null,0,null,0,null,0,null,0,0,"",0,{"$nulls":14},"No aplica",null,"No aplica",{"$f":"IF([7]Matriz!R223=\"Afecta el Impacto\",CONCATENATE(AW223,AZ223),CONCATENATE(AX223,AY223))","v":{"$error":"#REF!"}}]
[null,9,{"$nulls":17},0,null,0,null,0,null,0,null,0,null,0,null,0,0,"",0,{"$nulls":14},"No aplica",null,"No aplica",{"$f":"IF([7]Matriz!R224=\"Afecta el Impacto\",CONCATENATE(AW224,AZ224),CONCATENATE(AX224,AY224))","v":{"$error":"#REF!"}}]
["R25",1,"Factor_Interno","Procesos","Escasa Infraestructura física","\n\nPérdida y deterioro de historias académicas del archivos satélite","Acciones judiciales",3,{"$f":"IF(H225=5,\"Mas de una vez al año\",IF(H225=4,\"Al menos una vez en el ultimo año\",IF(H225=3,\"Al menos una vez en los ultimos 2 años\",IF(H225=2,\"Al menos una vez en los ultimos 5 años\",\"No se ha presentado en los ultimos 5 años\"))))","v":"Al menos una vez en los ultimos 2 años"},{"$f":"CONCATENATE(H$225,K$225)","v":"34"},4,{"$f":"IF(K225=5,\"Catastrófico\",IF(K225=4,\"Mayor\",IF(K225=3,\"Moderado\",IF(K225=2,\"Menos\",IF(K225=1,\"Insignificante\",\"Digite Valor entre 1 y 5\")))))","v":"Mayor"},{"$f":"IF(L225=\"Digite Valor entre 1 y 5\",\"\",IF(COUNTIF(CE$10:CE$17,CONCATENATE(H225,K225)),CE$9,IF(COUNTIF(CF$10:CF$17,CONCATENATE(H225,K225)),CF$9,IF(COUNTIF(CG$10:CG$13,CONCATENATE(H225,K225)),CG$9,CH$9))))","v":"Zona de Riesgo Extrema"},{"$f":"IF(M225=CE$9,\"E\",IF(M225=CF$9,\"A\",IF(M225=CG$9,\"M\",IF(M225=CH$9,\"B\",\"\"))))","v":"E"},"Control Preventivo","Revisión permanente del estado de las historias académicas","Continuo","Afecta la Probabilidad","Si",15,"Si",5,"No",0,"Si",10,"Si",15,"Si",10,"Si",30,85,"Disminuye la Probabilidad en 2",2,{"$f":"BD225","v":1},{"$f":"IF(AJ225=5,\"Mas de una vez al año\",IF(AJ225=4,\"Al menos una vez en el ultimo año\",IF(AJ225=3,\"Al menos una vez en los ultimos 2 años\",IF(AJ225=2,\"Al menos una vez en los ultimos 5 años\",\"No se ha presentado en los ultimos 5 años\"))))","v":"No se ha presentado en los ultimos 5 años"},{"$f":"BF225","v":4},{"$f":"IF(AL225=5,\"Catastrófico - Tendría desastrosas consecuencias o efectos sobre la institución\",IF(AL225=4,\"Mayor - Tendría altas consecuencias o efectos sobre la institución\",IF(AL225=3,\"Moderado - Tendría medianas consecuencias o efectos sobre la institución\",IF(AL225=2,\"Menos - Tendría bajo impacto o efecto sobre la institución\",IF(AL225=1,\"Insignificante - tendría consecuencias o efectos mínimos en la institución\",\"Digite Valor entre 1 y 5\")))))","v":"Mayor - Tendría altas consecuencias o efectos sobre la institución"},{"$f":"CONCATENATE(AJ225,AL225)","v":"14"},{"$f":"IF(COUNTIF($CE$10:$CE$17,AN225),$CE$9,IF(COUNTIF($CF$10:$CF$17,AN225),$CF$9,IF(COUNTIF($CG$10:$CG$13,AN225),$CG$9,IF(COUNTIF($CH$10:$CH$14,AN225),$CH$9,\"\"))))","v":"Zona de Riesgo Alta"},{"$f":"IF(AO225=$CE$9,\"E\",IF(AO225=$CF$9,\"A\",IF(AO225=$CG$9,\"M\",IF(AO225=$CH$9,\"B\",\"\"))))","v":"A"},null,"Continuar aplicando las normas archivisticas vigentes","Profesional Especialzado\nTecnico Administrativo","2016-01-01","2016-12-31","Registro de aplicación de normas",{"$f":"H225","v":3},{"$f":"IF(R225=\"Afecta la Probabilidad\",AW225-(AW225-AI225),\"No aplica\")","v":2},{"$f":"K225","v":4},{"$f":"IF(R225=\"Afecta el Impacto\",AY225-(AY225-AI225),\"No aplica\")","v":"No aplica"},{"$f":"IF(Matriz!R225=\"Afecta el Impacto\",CONCATENATE(AW225,AZ225),CONCATENATE(AX225,AY225))","v":"24"},{"$f":"IF(R225=\"\",\"\",SUMIF(R225:R233,\"Afecta la Probabilidad\",AX225:AX233))","v":4},{"$f":"IF(R225=\"\",\"\",SUMIF(R225:R233,\"Afecta el Impacto\",AZ225:AZ233))","v":0},{"$f":"IF(BB225=\"\",\"\",IF(H225-BB225<=0,1,H225-BB225))","v":1},{"$f":"CONCATENATE(BD225,BF225)","v":"14"},{"$f":"IF(K225=\"\",\"\",IF(K225-BC225<0,1,K225-BC225))","v":4}]
[null,2,"Factor_Interno","Procesos","Alto volumen de historias académicas",null,"Perdida de iamgen instiucional",{"$nulls":7},"Control Preventivo","Actualización de inventarios","Continuo","Afecta la Probabilidad","Si",15,"Si",5,"No",0,"Si",10,"Si",15,"Si",10,"Si",30,85,"Disminuye la Probabilidad en 2",2,{"$nulls":8},"Gestionar la amplicación de espacio físico para historias académicas","Profesional Especialzado\nTecnico Administrativo","2016-01-01","2016-12-31","Documento de solicitud",null,2,null,"No aplica",{"$f":"IF(Matriz!R226=\"Afecta el Impacto\",CONCATENATE(AW226,AZ226),CONCATENATE(AX226,AY226))","v":"2"}]
[null,{"$f":"B226+1","v":3},"Factor_Externo","Medioambientales","Inducaciones, roedores, humedad, incendios entre otros",null,"Desgaste administrativo",{"$nulls":12},0,null,0,null,0,null,0,null,0,null,0,null,0,0,"",0,{"$nulls":14},"No aplica",null,"No aplica",{"$f":"IF(Matriz!R227=\"Afecta el Impacto\",CONCATENATE(AW227,AZ227),CONCATENATE(AX227,AY227))","v":"No aplica"}]
[null,4,{"$nulls":17},0,null,0,null,0,null,0,null,0,null,0,null,0,0,"",0,{"$nulls":14},"No aplica",null,"No aplica",{"$f":"IF(Matriz!R228=\"Afecta el Impacto\",CONCATENATE(AW228,AZ228),CONCATENATE(AX228,AY228))","v":"No aplica"}]
[null,5,{"$nulls":17},0,null,0,null,0,null,0,null,0,null,0,null,0,0,"",0,{"$nulls":14},"No aplica",null,"No aplica",{"$f":"IF(Matriz!R229=\"Afecta el Impacto\",CONCATENATE(AW229,AZ229),CONCATENATE(AX229,AY229))","v":"No aplica"}]
[null,6,{"$nulls":17},0,null,0,null,0,null,0,null,0,null,0,null,0,0,"",0,{"$nulls":14},"No aplica",null,"No aplica",{"$f":"IF(Matriz!R230=\"Afecta el Impacto\",CONCATENATE(AW230,AZ230),CONCATENATE(AX230,AY230))","v":"No aplica"}]
[null,7,{"$nulls":17},0,null,0,null,0,null,0,null,0,null,0,null,0,0,"",0,{"$nulls":14},"No aplica",null,"No aplica",{"$f":"IF(Matriz!R231=\"Afecta el Impacto\",CONCATENATE(AW231,AZ231),CONCATENATE(AX231,AY231))","v":"No aplica"}]
[null,8,{"$nulls":17},0,null,0,null,0,null,0,null,0,null,0,null,0,0,"",0,{"$nulls":14},"No aplica",null,"No aplica",{"$f":"IF(Matriz!R232=\"Afecta el Impacto\",CONCATENATE(AW232,AZ232),CONCATENATE(AX232,AY232))","v":"No aplica"}]
[null,9,{"$nulls":17},0,null,0,null,0,null,0,null,0,null,0,null,0,0,"",0,{"$nulls":14},"No aplica",null,"No aplica",{"$f":"IF(Matriz!R233=\"Afecta el Impacto\",CONCATENATE(AW233,AZ233),CONCATENATE(AX233,AY233))","v":"No aplica"}]
["R26",1,"Factor_Interno","Personal","Desconocimiento  de las normas internas y externas que regulan a la Universidad.","Expedición de actos administrativos, conceptos jurídicos y asesorias legales contrarias a las normas internas y externas que amparan las actuaciones de la Universidad","Acciones judiciales en contra de la Universidad.\nDenuncias en contra de funcionarios de la institución.",1,{"$f":"IF(H234=5,\"Mas de una vez al año\",IF(H234=4,\"Al menos una vez en el ultimo año\",IF(H234=3,\"Al menos una vez en los ultimos 2 años\",IF(H234=2,\"Al menos una vez en los ultimos 5 años\",\"No se ha presentado en los ultimos 5 años\"))))","v":"No se ha presentado en los ultimos 5 años"},{"$f":"CONCATENATE(H$234,K$234)","v":"14"},4,{"$f":"IF(K234=5,\"Catastrófico\",IF(K234=4,\"Mayor\",IF(K234=3,\"Moderado\",IF(K234=2,\"Menos\",IF(K234=1,\"Insignificante\",\"Digite Valor entre 1 y 5\")))))","v":"Mayor"},"Zona de Riesgo Alta",{"$f":"IF(M234=CE$9,\"E\",IF(M234=CF$9,\"A\",IF(M234=CG$9,\"M\",IF(M234=CH$9,\"B\",\"\"))))","v":"A"},"Control Preventivo","Jornadas de capacitación","Trimestral","Afecta la Probabilidad","Si",15,"Si",5,"No",0,"Si",10,"Si",15,"Si",10,"Si",30,85,"Disminuye la Probabilidad en 2",2,{"$f":"BD234","v":1},{"$f":"IF(AJ234=5,\"Mas de una vez al año\",IF(AJ234=4,\"Al menos una vez en el ultimo año\",IF(AJ234=3,\"Al menos una vez en los ultimos 2 años\",IF(AJ234=2,\"Al menos una vez en los ultimos 5 años\",\"No se ha presentado en los ultimos 5 años\"))))","v":"No se ha presentado en los ultimos 5 años"},{"$f":"BF234","v":4},{"$f":"IF(AL234=5,\"Catastrófico - Tendría desastrosas consecuencias o efectos sobre la institución\",IF(AL234=4,\"Mayor - Tendría altas consecuencias o efectos sobre la institución\",IF(AL234=3,\"Moderado - Tendría medianas consecuencias o efectos sobre la institución\",IF(AL234=2,\"Menos - Tendría bajo impacto o efecto sobre la institución\",IF(AL234=1,\"Insignificante - tendría consecuencias o efectos mínimos en la institución\",\"Digite Valor entre 1 y 5\")))))","v":"Mayor - Tendría altas consecuencias o efectos sobre la institución"},{"$f":"CONCATENATE(AJ234,AL234)","v":"14"},{"$f":"IF(COUNTIF($CE$10:$CE$17,AN234),$CE$9,IF(COUNTIF($CF$10:$CF$17,AN234),$CF$9,IF(COUNTIF($CG$10:$CG$13,AN234),$CG$9,IF(COUNTIF($CH$10:$CH$14,AN234),$CH$9,\"\"))))","v":"Zona de Riesgo Alta"},{"$f":"IF(AO234=$CE$9,\"E\",IF(AO234=$CF$9,\"A\",IF(AO234=$CG$9,\"M\",IF(AO234=$CH$9,\"B\",\"\"))))","v":"A"},null,"Realizar las formaciones que los funcionarios requieran para el buen desempeño de sus funciones.","Profesional Especializado talento Humano y Jefe Oficina Jurídica ","2106-01-01","2016-12-31",null,{"$f":"H234","v":1},2,{"$f":"K234","v":4},"No aplica",null,{"$f":"IF(R234=\"\",\"\",SUMIF(R234:R242,\"Afecta la Probabilidad\",AX234:AX242))","v":2},{"$f":"IF(R234=\"\",\"\",SUMIF(R234:R242,\"Afecta el Impacto\",AZ234:AZ242))","v":0},{"$f":"IF(BB234=\"\",\"\",IF(H234-BB234<=0,1,H234-BB234))","v":1},null,{"$f":"IF(K234=\"\",\"\",IF(K234-BC234<0,1,K234-BC234))","v":4}]
[null,{"$f":"B234+1","v":2},"Factor_Interno","Procesos",{"$nulls":15},0,"Si",5,null,0,null,0,null,0,"Si",10,"Si",30,45,"",0,{"$nulls":10},"2106-01-01","2016-12-31",null,null,"No aplica",null,"No aplica"]
[null,3,{"$nulls":17},0,null,0,null,0,null,0,null,0,null,0,null,0,0,"",0,{"$nulls":14},"No aplica",null,"No aplica"]
[null,4,{"$nulls":17},0,null,0,null,0,null,0,null,0,null,0,null,0,0,"",0,{"$nulls":14},"No aplica",null,"No aplica"]
[null,5,{"$nulls":17},0,null,0,null,0,null,0,null,0,null,0,null,0,0,"",0,{"$nulls":14},"No aplica",null,"No aplica"]
[null,6,{"$nulls":17},0,null,0,null,0,null,0,null,0,null,0,null,0,0,"",0,{"$nulls":14},"No aplica",null,"No aplica"]
[null,7,{"$nulls":17},0,null,0,null,0,null,0,null,0,null,0,null,0,0,"",0,{"$nulls":14},"No aplica",null,"No aplica"]
[null,8,{"$nulls":17},0,null,0,null,0,null,0,null,0,null,0,null,0,0,"",0,{"$nulls":14},"No aplica",null,"No aplica"]
[null,9,{"$nulls":17},0,null,0,null,0,null,0,null,0,null,0,null,0,0,"",0,{"$nulls":14},"No aplica",null,"No aplica"]
["R27",1,"Factor_Interno","Procesos","Falta de evidencias de los antecedentes administrativos para atender las acciones judiciales y las actuaciones administrativas","Presentación o contestación de acciones judiciales y actuaciones administrativas sin las evidencias necesarias","Acción judicial en contra de la Universidad.\nSanciones administrativas, disciplinarias, penales o responsabilidad fiscal según el caso.",1,{"$f":"IF(H243=5,\"Mas de una vez al año\",IF(H243=4,\"Al menos una vez en el ultimo año\",IF(H243=3,\"Al menos una vez en los ultimos 2 años\",IF(H243=2,\"Al menos una vez en los ultimos 5 años\",\"No se ha presentado en los ultimos 5 años\"))))","v":"No se ha presentado en los ultimos 5 años"},{"$f":"CONCATENATE(H$243,K$243)","v":"14"},4,{"$f":"IF(K243=5,\"Catastrófico\",IF(K243=4,\"Mayor\",IF(K243=3,\"Moderado\",IF(K243=2,\"Menos\",IF(K243=1,\"Insignificante\",\"Digite Valor entre 1 y 5\")))))","v":"Mayor"},"Zona de Riesgo Alta",{"$f":"IF(M243=CE$9,\"E\",IF(M243=CF$9,\"A\",IF(M243=CG$9,\"M\",IF(M243=CH$9,\"B\",\"\"))))","v":"A"},"Control Preventivo","Solicitud de los antecedentes administrativos a las dependencias involucradas","A Solicitud","Afecta la Probabilidad","No",0,"Si",5,"No",0,"Si",10,"Si",15,"Si",10,"Si",30,70,"Disminuye la Probabilidad en 1",1,{"$f":"BD243","v":1},{"$f":"IF(AJ243=5,\"Mas de una vez al año\",IF(AJ243=4,\"Al menos una vez en el ultimo año\",IF(AJ243=3,\"Al menos una vez en los ultimos 2 años\",IF(AJ243=2,\"Al menos una vez en los ultimos 5 años\",\"No se ha presentado en los ultimos 5 años\"))))","v":"No se ha presentado en los ultimos 5 años"},{"$f":"BF243","v":4},{"$f":"IF(AL243=5,\"Catastrófico - Tendría desastrosas consecuencias o efectos sobre la institución\",IF(AL243=4,\"Mayor - Tendría altas consecuencias o efectos sobre la institución\",IF(AL243=3,\"Moderado - Tendría medianas consecuencias o efectos sobre la institución\",IF(AL243=2,\"Menos - Tendría bajo impacto o efecto sobre la institución\",IF(AL243=1,\"Insignificante - tendría consecuencias o efectos mínimos en la institución\",\"Digite Valor entre 1 y 5\")))))","v":"Mayor - Tendría altas consecuencias o efectos sobre la institución"},{"$f":"CONCATENATE(AJ243,AL243)","v":"14"},{"$f":"IF(COUNTIF($CE$10:$CE$17,AN243),$CE$9,IF(COUNTIF($CF$10:$CF$17,AN243),$CF$9,IF(COUNTIF($CG$10:$CG$13,AN243),$CG$9,IF(COUNTIF($CH$10:$CH$14,AN243),$CH$9,\"\"))))","v":"Zona de Riesgo Alta"},{"$f":"IF(AO243=$CE$9,\"E\",IF(AO243=$CF$9,\"A\",IF(AO243=$CG$9,\"M\",IF(AO243=$CH$9,\"B\",\"\"))))","v":"A"},null,"Solicitud de los antecedentes administrativos a las dependencias involucradas","Jefe Oficina Jurídica","2016-01-01","2016-12-31","Oficios dde solicitud a als diferentes areas involucradas.",1,1,4,"No aplica",null,1,0,1,null,4]
[null,{"$f":"B243+1","v":2},{"$nulls":17},0,null,0,null,0,null,0,null,0,null,0,null,0,0,"",0,{"$nulls":14},"No aplica",null,"No aplica"]
[null,3,{"$nulls":17},0,null,0,null,0,null,0,null,0,null,0,null,0,0,"",0,{"$nulls":14},"No aplica",null,"No aplica"]
[null,4,{"$nulls":17},0,null,0,null,0,null,0,null,0,null,0,null,0,0,"",0,{"$nulls":14},"No aplica",null,"No aplica"]
[null,5,{"$nulls":17},0,null,0,null,0,null,0,null,0,null,0,null,0,0,"",0,{"$nulls":14},"No aplica",null,"No aplica"]
[null,6,{"$nulls":17},0,null,0,null,0,null,0,null,0,null,0,null,0,0,"",0,{"$nulls":14},"No aplica",null,"No aplica"]
[null,7,{"$nulls":17},0,null,0,null,0,null,0,null,0,null,0,null,0,0,"",0,{"$nulls":14},"No aplica",null,"No aplica"]
[null,8,{"$nulls":17},0,null,0,null,0,null,0,null,0,null,0,null,0,0,"",0,{"$nulls":14},"No aplica",null,"No aplica"]
[null,9,{"$nulls":17},0,null,0,null,0,null,0,null,0,null,0,null,0,0,"",0,{"$nulls":14},"No aplica",null,"No aplica"]
["R28",1,"Factor_Interno","Estratégicos","Falta de conocimiento de los funcionarios en el momento de solicitar los bienes ","Información imprecisa en las especificaciones al momento de la  solicitud  de bienes y suministros por parte de los procesos universitarios ","Detrimento del patrimonio",3,"Al menos una vez en los ultimos 2 años","34",4,"Mayor","Zona de Riesgo Extrema","E","Control Preventivo","Procedimiento de Adquisiciones y Control de Bienes","Continuo","Afecta la Probabilidad","Si",15,"Si",5,"No",0,"Si",10,"No",0,"Si",10,"No",0,40,"No disminuye la Probabilidad",0,{"$f":"BD252","v":3},{"$f":"IF(AJ252=5,\"Mas de una vez al año\",IF(AJ252=4,\"Al menos una vez en el ultimo año\",IF(AJ252=3,\"Al menos una vez en los ultimos 2 años\",IF(AJ252=2,\"Al menos una vez en los ultimos 5 años\",\"No se ha presentado en los ultimos 5 años\"))))","v":"Al menos una vez en los ultimos 2 años"},{"$f":"BF252","v":4},{"$f":"IF(AL252=5,\"Catastrófico - Tendría desastrosas consecuencias o efectos sobre la institución\",IF(AL252=4,\"Mayor - Tendría altas consecuencias o efectos sobre la institución\",IF(AL252=3,\"Moderado - Tendría medianas consecuencias o efectos sobre la institución\",IF(AL252=2,\"Menos - Tendría bajo impacto o efecto sobre la institución\",IF(AL252=1,\"Insignificante - tendría consecuencias o efectos mínimos en la institución\",\"Digite Valor entre 1 y 5\")))))","v":"Mayor - Tendría altas consecuencias o efectos sobre la institución"},{"$f":"CONCATENATE(AJ252,AL252)","v":"34"},{"$f":"IF(COUNTIF($CE$10:$CE$17,AN252),$CE$9,IF(COUNTIF($CF$10:$CF$17,AN252),$CF$9,IF(COUNTIF($CG$10:$CG$13,AN252),$CG$9,IF(COUNTIF($CH$10:$CH$14,AN252),$CH$9,\"\"))))","v":"Zona de Riesgo Extrema"},{"$f":"IF(AO252=$CE$9,\"E\",IF(AO252=$CF$9,\"A\",IF(AO252=$CG$9,\"M\",IF(AO252=$CH$9,\"B\",\"\"))))","v":"E"},"El plan de Adquisiciones no depende del Área de Adquisiciones e inventarios","Programar reuniones con las diferentes instancias universitarias para socializar el procedimiento sobre las planeación de las necesidades reales en suministros y servicios para el siguiente año ","Oficina de Planeación y Desarrollo Inatitucional - Centro de Calidad  y la Acreditación Institucional\n","2016-01-01","2016-12-31","Registros de asistencia y actas ",3,0,4,"No aplica",null,0,0,3,null,4]
[null,{"$f":"B252+1","v":2},"Factor_Interno","Personal","Falta de planeación  de necesidades",null,"Sanciones\n",{"$nulls":12},0,null,0,null,0,null,0,null,0,null,0,null,0,0,"",0,{"$nulls":14},"No aplica",null,"No aplica"]
[null,3,"Factor_Interno","Procesos","Desconocimiento del procedimiento",null,"Pérdida de credibilidad",{"$nulls":12},0,null,0,null,0,null,0,null,0,null,0,null,0,0,"",0,{"$nulls":14},"No aplica",null,"No aplica"]
[null,4,{"$nulls":17},0,null,0,null,0,null,0,null,0,null,0,null,0,0,"",0,{"$nulls":14},"No aplica",null,"No aplica"]
[null,5,{"$nulls":17},0,null,0,null,0,null,0,null,0,null,0,null,0,0,"",0,{"$nulls":14},"No aplica",null,"No aplica"]
[null,6,{"$nulls":17},0,null,0,null,0,null,0,null,0,null,0,null,0,0,"",0,{"$nulls":14},"No aplica",null,"No aplica"]
[null,7,{"$nulls":17},0,null,0,null,0,null,0,null,0,null,0,null,0,0,"",0,{"$nulls":14},"No aplica",null,"No aplica"]
[null,8,{"$nulls":17},0,null,0,null,0,null,0,null,0,null,0,null,0,0,"",0,{"$nulls":14},"No aplica",null,"No aplica"]
[null,9,{"$nulls":17},0,null,0,null,0,null,0,null,0,null,0,null,0,0,"",0,{"$nulls":14},"No aplica",null,"No aplica"]
["R29",1,"Factor_Interno","Personal"," Falta de seguimiento a las diferentes etapas que se surten dentro de las acciones judiciales y las actuaciones administrativas.\n","Vencimiento de términos judiciales y legales para atender o interponer acciones judiciales o actuaciones administrativas","Fallos judiciales o administrativos contrarios a la institución que conlleven a sanciones administrativas, disciplinarias, penales o responsabilidad fiscal según el caso.",1,"No se ha presentado en los ultimos 5 años","14",4,"Mayor","Zona de Riesgo Alta","A","Control Preventivo","Asignación oportuna de la acción judicial a un Asesor Jurídico \n","Continuo","Afecta la Probabilidad","Si",15,"Si",5,"No",0,"Si",10,"Si",15,"Si",10,"Si",30,85,"Disminuye la Probabilidad en 2",2,{"$f":"BD261","v":1},{"$f":"IF(AJ261=5,\"Mas de una vez al año\",IF(AJ261=4,\"Al menos una vez en el ultimo año\",IF(AJ261=3,\"Al menos una vez en los ultimos 2 años\",IF(AJ261=2,\"Al menos una vez en los ultimos 5 años\",\"No se ha presentado en los ultimos 5 años\"))))","v":"No se ha presentado en los ultimos 5 años"},{"$f":"BF261","v":4},{"$f":"IF(AL261=5,\"Catastrófico - Tendría desastrosas consecuencias o efectos sobre la institución\",IF(AL261=4,\"Mayor - Tendría altas consecuencias o efectos sobre la institución\",IF(AL261=3,\"Moderado - Tendría medianas consecuencias o efectos sobre la institución\",IF(AL261=2,\"Menos - Tendría bajo impacto o efecto sobre la institución\",IF(AL261=1,\"Insignificante - tendría consecuencias o efectos mínimos en la institución\",\"Digite Valor entre 1 y 5\")))))","v":"Mayor - Tendría altas consecuencias o efectos sobre la institución"},{"$f":"CONCATENATE(AJ261,AL261)","v":"14"},{"$f":"IF(COUNTIF($CE$10:$CE$17,AN261),$CE$9,IF(COUNTIF($CF$10:$CF$17,AN261),$CF$9,IF(COUNTIF($CG$10:$CG$13,AN261),$CG$9,IF(COUNTIF($CH$10:$CH$14,AN261),$CH$9,\"\"))))","v":"Zona de Riesgo Alta"},{"$f":"IF(AO261=$CE$9,\"E\",IF(AO261=$CF$9,\"A\",IF(AO261=$CG$9,\"M\",IF(AO261=$CH$9,\"B\",\"\"))))","v":"A"},null,"Asignar oportunamente al profesional responsable del procedimiento","Jefe Oficina Juridica\nProfesional Universitario responsable del procedimiento","2016-01-01","2016-12-31","Registro de designación al profesional responsable.",1,2,4,"No aplica",null,4,0,1,null,4]
[null,{"$f":"B261+1","v":2},{"$nulls":13},"Revisión del Diario Judicial que reporta el movimiento de los procesos jurídicos","Continuo","Afecta la Probabilidad","Si",15,"Si",5,"No",0,"Si",10,"Si",15,"Si",10,"Si",30,85,"Disminuye la Probabilidad en 2",2,{"$nulls":8},"Realizar la revision de los estados judiciales oportunamente y cumplir con los términos de Ley ","Jefe Oficina Juridica\nProfesional Universitario responsable del procedimiento","2016-01-01","2016-12-31","Reportes del estado de los procesos\na la plataforma EKOGUI",null,2,null,"No aplica"]
[null,3,{"$nulls":17},0,null,0,null,0,null,0,null,0,null,0,null,0,0,"",0,{"$nulls":14},"No aplica",null,"No aplica"]
[null,4,{"$nulls":17},0,null,0,null,0,null,0,null,0,null,0,null,0,0,"",0,{"$nulls":14},"No aplica",null,"No aplica"]
[null,5,{"$nulls":17},0,null,0,null,0,null,0,null,0,null,0,null,0,0,"",0,{"$nulls":14},"No aplica",null,"No aplica"]
[null,6,{"$nulls":17},0,null,0,null,0,null,0,null,0,null,0,null,0,0,"",0,{"$nulls":14},"No aplica",null,"No aplica"]
[null,7,{"$nulls":17},0,null,0,null,0,null,0,null,0,null,0,null,0,0,"",0,{"$nulls":14},"No aplica",null,"No aplica"]
[null,8,{"$nulls":17},0,null,0,null,0,null,0,null,0,null,0,null,0,0,"",0,{"$nulls":14},"No aplica",null,"No aplica"]
[null,9,{"$nulls":17},0,null,0,null,0,null,0,null,0,null,0,null,0,0,"",0,{"$nulls":14},"No aplica",null,"No aplica"]
["R30",1,"Factor_Interno","Procesos","Escasa Infraestructura física","Pérdida y deterioro de historias académicas del archivos satélite","Acciones judiciales",3,"Al menos una vez en los ultimos 2 años","34",4,"Mayor","Zona de Riesgo Extrema","E","Control Preventivo","Revisión permanente del estado de las historias académicas","Continuo","Afecta la Probabilidad","Si",15,"Si",5,"No",0,"Si",10,"Si",15,"Si",10,"Si",30,85,"Disminuye la Probabilidad en 2",2,{"$f":"BD270","v":1},{"$f":"IF(AJ270=5,\"Mas de una vez al año\",IF(AJ270=4,\"Al menos una vez en el ultimo año\",IF(AJ270=3,\"Al menos una vez en los ultimos 2 años\",IF(AJ270=2,\"Al menos una vez en los ultimos 5 años\",\"No se ha presentado en los ultimos 5 años\"))))","v":"No se ha presentado en los ultimos 5 años"},{"$f":"BF270","v":4},{"$f":"IF(AL270=5,\"Catastrófico - Tendría desastrosas consecuencias o efectos sobre la institución\",IF(AL270=4,\"Mayor - Tendría altas consecuencias o efectos sobre la institución\",IF(AL270=3,\"Moderado - Tendría medianas consecuencias o efectos sobre la institución\",IF(AL270=2,\"Menos - Tendría bajo impacto o efecto sobre la institución\",IF(AL270=1,\"Insignificante - tendría consecuencias o efectos mínimos en la institución\",\"Digite Valor entre 1 y 5\")))))","v":"Mayor - Tendría altas consecuencias o efectos sobre la institución"},{"$f":"CONCATENATE(AJ270,AL270)","v":"14"},{"$f":"IF(COUNTIF($CE$10:$CE$17,AN270),$CE$9,IF(COUNTIF($CF$10:$CF$17,AN270),$CF$9,IF(COUNTIF($CG$10:$CG$13,AN270),$CG$9,IF(COUNTIF($CH$10:$CH$14,AN270),$CH$9,\"\"))))","v":"Zona de Riesgo Alta"},{"$f":"IF(AO270=$CE$9,\"E\",IF(AO270=$CF$9,\"A\",IF(AO270=$CG$9,\"M\",IF(AO270=$CH$9,\"B\",\"\"))))","v":"A"},null,"Continuar aplicando las normas archivisticas vigentes","Profesional Especialzado\nTecnico Administrativo","2016-01-01","2016-12-31","Registro de aplicación de normas",3,2,4,"No aplica",null,4,0,1,null,4]
[null,{"$f":"B270+1","v":2},"Factor_Interno","Procesos","Alto volumen de historias académicas",null,"Pérdida de iamgen instiucional",{"$nulls":7},"Control Preventivo","Actualización de inventarios","Continuo","Afecta la Probabilidad","Si",15,"Si",5,"No",0,"Si",10,"Si",15,"Si",10,"Si",30,85,"Disminuye la Probabilidad en 2",2,{"$nulls":8},"Gestionar la ampliación de espacio físico para historias académicas","Profesional Especialzado\nTecnico Administrativo","2016-01-01","2016-12-31","Documento de solicitud",null,2,null,"No aplica"]
[null,3,"Factor_Externo","Medioambientales","Inducaciones, roedores, humedad, incendios entre otros",null,"Desgaste administrativo",{"$nulls":12},0,null,0,null,0,null,0,null,0,null,0,null,0,0,"",0,{"$nulls":14},"No aplica",null,"No aplica"]
[null,4,{"$nulls":17},0,null,0,null,0,null,0,null,0,null,0,null,0,0,"",0,{"$nulls":14},"No aplica",null,"No aplica"]
[null,5,{"$nulls":17},0,null,0,null,0,null,0,null,0,null,0,null,0,0,"",0,{"$nulls":14},"No aplica",null,"No aplica"]
[null,6,{"$nulls":17},0,null,0,null,0,null,0,null,0,null,0,null,0,0,"",0,{"$nulls":14},"No aplica",null,"No aplica"]
[null,7,{"$nulls":17},0,null,0,null,0,null,0,null,0,null,0,null,0,0,"",0,{"$nulls":14},"No aplica",null,"No aplica"]
[null,8,{"$nulls":17},0,null,0,null,0,null,0,null,0,null,0,null,0,0,"",0,{"$nulls":14},"No aplica",null,"No aplica"]
[null,9,{"$nulls":17},0,null,0,null,0,null,0,null,0,null,0,null,0,0,"",0,{"$nulls":14},"No aplica",null,"No aplica"]
["R31",1,"Factor_Externo","Medioambientales","\nInundación y/o goteras","Pérdida de información documental","Pérdida de la memoria documental institucional",5,"Mas de una vez al año","55",5,"Catastrófico","Zona de Riesgo Extrema","E","Control Preventivo","Seguimiento a producción documental","Semestral","Afecta la Probabilidad","Si",15,"Si",5,"No",0,"Si",10,"Si",15,"Si",10,"Si",30,85,"Disminuye la Probabilidad en 2",2,{"$f":"BD279","v":1},{"$f":"IF(AJ279=5,\"Mas de una vez al año\",IF(AJ279=4,\"Al menos una vez en el ultimo año\",IF(AJ279=3,\"Al menos una vez en los ultimos 2 años\",IF(AJ279=2,\"Al menos una vez en los ultimos 5 años\",\"No se ha presentado en los ultimos 5 años\"))))","v":"No se ha presentado en los ultimos 5 años"},{"$f":"BF279","v":5},{"$f":"IF(AL279=5,\"Catastrófico - Tendría desastrosas consecuencias o efectos sobre la institución\",IF(AL279=4,\"Mayor - Tendría altas consecuencias o efectos sobre la institución\",IF(AL279=3,\"Moderado - Tendría medianas consecuencias o efectos sobre la institución\",IF(AL279=2,\"Menos - Tendría bajo impacto o efecto sobre la institución\",IF(AL279=1,\"Insignificante - tendría consecuencias o efectos mínimos en la institución\",\"Digite Valor entre 1 y 5\")))))","v":"Catastrófico - Tendría desastrosas consecuencias o efectos sobre la institución"},{"$f":"CONCATENATE(AJ279,AL279)","v":"15"},{"$f":"IF(COUNTIF($CE$10:$CE$17,AN279),$CE$9,IF(COUNTIF($CF$10:$CF$17,AN279),$CF$9,IF(COUNTIF($CG$10:$CG$13,AN279),$CG$9,IF(COUNTIF($CH$10:$CH$14,AN279),$CH$9,\"\"))))","v":"Zona de Riesgo Alta"},{"$f":"IF(AO279=$CE$9,\"E\",IF(AO279=$CF$9,\"A\",IF(AO279=$CG$9,\"M\",IF(AO279=$CH$9,\"B\",\"\"))))","v":"A"},null,"Realizar visitas  a dependencias académicos y administrativas para verificar y revisar la producción documental física y electrónica","Técnico Administrativo\nCoordinador Gestión Documental","2016-01-01","2016-12-31","Actas de seguimiento\nPlanes de mejoramiento",5,2,5,"No aplica",null,5,0,1,null,5]
[null,{"$f":"B279+1","v":2},"Factor_Externo","Medioambientales","Agentes biológicos\n(Roedores  y plagas, hongos)",null,"Incremento de gastos operativos por desgaste administrativo",{"$nulls":7},"Control Preventivo","Mantenimiento de las instalaciones del\nárea de conservación de la documentación (fumigación, limpieza, control de humedad y temperatura).","Trimestral","Afecta la Probabilidad","No",0,"No",0,"No",0,"Si",10,"Si",15,"No",0,"No",0,25,"No disminuye la Probabilidad",0,{"$nulls":8},"Solicitar a la División Administrativa y de servicios el mantenimiento  con respecto al aseo y fumigaciones (Cuadro de fumigaciones elaborado por Gestión documental) ","Profesional especializado DAS\nTécnico Administrativo\nCoordinador Gestión Documental","2016-01-01","2016-12-31","Documento de solicitud\nCuadro de mantenimiento \nDocumento control de visitas",null,0,null,"No aplica"]
[null,3,"Factor_Externo","Medioambientales","Terremotos, catastrofes, asonadas, Incendio",null,"Procesos disciplinarios internos e Investigaciones a cargo de los entes de control estatales",{"$nulls":7},"Control Preventivo","\n\nMonitoreo permanente de las instalaciones del archivo total.","Trimestral","Afecta la Probabilidad","Si",15,"Si",5,"No",0,"Si",10,"Si",15,"Si",10,"No",0,55,"Disminuye la Probabilidad en 1",1,{"$nulls":8},"Realizar visitas para  monitorear el estado  de las instalaciones del archivo total."," Técnico Administrativo\nCoordinador Gestión Documental","2016-01-01","2016-12-31","Informes de visita\nPlan demejoramiento",null,1,null,"No aplica"]
[null,4,"Factor_Interno","Tecnología","Fallas técnicas en las herramientas tecnológicas para la administración de la información ",null," Traumatismo en el proceso de gestión\ndocumental.",{"$nulls":7},"Control Preventivo","Tablas de retención documental.","Continuo","Afecta la Probabilidad","Si",15,"Si",5,"No",0,"Si",10,"Si",15,"Si",10,"Si",30,85,"Disminuye la Probabilidad en 2",2,{"$nulls":8},"Realizar capacitaciones para el manejo correcto de las TRD en las dependencias universitarias","Técnico Administrativo\nCoordinador Gestión Documental","2016-01-01","2016-12-31","Actas\nOficios remisorios de solicitudes\nInformes de visita",null,2,null,"No aplica"]
[null,5,"Factor_Interno","Procesos","Deficiencia del sistema administrativo",null,"Reprocesos y pérdidas económicas",{"$nulls":12},0,null,0,null,0,null,0,null,0,null,0,null,0,0,"",0,{"$nulls":14},"No aplica",null,"No aplica"]
[null,6,"Factor_Interno","Procesos","Falta de infraestructura fisica para el acervo documental",null,"Enfermedades ocupacionales",{"$nulls":12},0,null,0,null,0,null,0,null,0,null,0,null,0,0,"",0,{"$nulls":14},"No aplica",null,"No aplica"]
[null,7,"Factor_Interno","Personal","Debilidad en el conocimiento de las TRD ",{"$nulls":14},0,null,0,null,0,null,0,null,0,null,0,null,0,0,"",0,{"$nulls":14},"No aplica",null,"No aplica"]
[null,8,{"$nulls":17},0,null,0,null,0,null,0,null,0,null,0,null,0,0,"",0,{"$nulls":14},"No aplica",null,"No aplica"]
[null,9,{"$nulls":17},0,null,0,null,0,null,0,null,0,null,0,null,0,0,"",0,{"$nulls":14},"No aplica",null,"No aplica"]
["R32",1,"Factor_Externo","Sociales","Entrega de información socioeconómica  fraudelenta por parte de los aspirantes","Debilidades  en la base de liquidacion de matrícula","Perdida de recursos",4,"Al menos una vez en el ultimo año","44",4,"Mayor","Zona de Riesgo Extrema","E","Control Preventivo","Sottware SIMCA","Continuo","Afecta la Probabilidad",null,0,null,0,null,0,null,0,null,0,null,0,null,0,0,"No disminuye la Probabilidad",0,{"$f":"BD288","v":4},{"$f":"IF(AJ288=5,\"Mas de una vez al año\",IF(AJ288=4,\"Al menos una vez en el ultimo año\",IF(AJ288=3,\"Al menos una vez en los ultimos 2 años\",IF(AJ288=2,\"Al menos una vez en los ultimos 5 años\",\"No se ha presentado en los ultimos 5 años\"))))","v":"Al menos una vez en el ultimo año"},{"$f":"BF288","v":4},{"$f":"IF(AL288=5,\"Catastrófico - Tendría desastrosas consecuencias o efectos sobre la institución\",IF(AL288=4,\"Mayor - Tendría altas consecuencias o efectos sobre la institución\",IF(AL288=3,\"Moderado - Tendría medianas consecuencias o efectos sobre la institución\",IF(AL288=2,\"Menos - Tendría bajo impacto o efecto sobre la institución\",IF(AL288=1,\"Insignificante - tendría consecuencias o efectos mínimos en la institución\",\"Digite Valor entre 1 y 5\")))))","v":"Mayor - Tendría altas consecuencias o efectos sobre la institución"},{"$f":"CONCATENATE(AJ288,AL288)","v":"44"},{"$f":"IF(COUNTIF($CE$10:$CE$17,AN288),$CE$9,IF(COUNTIF($CF$10:$CF$17,AN288),$CF$9,IF(COUNTIF($CG$10:$CG$13,AN288),$CG$9,IF(COUNTIF($CH$10:$CH$14,AN288),$CH$9,\"\"))))","v":"Zona de Riesgo Extrema"},{"$f":"IF(AO288=$CE$9,\"E\",IF(AO288=$CF$9,\"A\",IF(AO288=$CG$9,\"M\",IF(AO288=$CH$9,\"B\",\"\"))))","v":"E"},"Se dificulta la verificación socioeconomica de los aspirantes en general","Presentar propuesta de modificación o ajustes de la base de liquidación de matricula","Consejo Académico\nComité  de admisiones\nProfesional Especialziado DARCA","2016-06-01","2016-12-31","Documento de propuesta",4,0,4,"No aplica",null,0,0,4,null,4]
[null,{"$f":"B288+1","v":2},{"$nulls":4},"Degaste administrativo",{"$nulls":12},0,null,0,null,0,null,0,null,0,null,0,null,0,0,"",0,{"$nulls":14},{"$f":"IF(R289=\"Afecta la Probabilidad\",AW289-(AW289-AI289),\"No aplica\")","v":"No aplica"},null,{"$f":"IF(R289=\"Afecta el Impacto\",AY289-(AY289-AI289),\"No aplica\")","v":"No aplica"}]
[null,3,{"$nulls":17},0,null,0,null,0,null,0,null,0,null,0,null,0,0,"",0,{"$nulls":14},"No aplica",null,"No aplica"]
[null,4,{"$nulls":17},0,null,0,null,0,null,0,null,0,null,0,null,0,0,"",0,{"$nulls":14},"No aplica",null,"No aplica"]
[null,5,{"$nulls":17},0,null,0,null,0,null,0,null,0,null,0,null,0,0,"",0,{"$nulls":14},"No aplica",null,"No aplica"]
[null,6,{"$nulls":17},0,null,0,null,0,null,0,null,0,null,0,null,0,0,"",0,{"$nulls":14},"No aplica",null,"No aplica"]
[null,7,{"$nulls":17},0,null,0,null,0,null,0,null,0,null,0,null,0,0,"",0,{"$nulls":14},"No aplica",null,"No aplica"]
[null,8,{"$nulls":17},0,null,0,null,0,null,0,null,0,null,0,null,0,0,"",0,{"$nulls":14},"No aplica",null,"No aplica"]
[null,9,{"$nulls":17},0,null,0,null,0,null,0,null,0,null,0,null,0,0,"",0,{"$nulls":14},"No aplica",null,"No aplica"]
["R33",1,"Factor_Externo","Sociales","Deshonestidad del aspirante","Fraude/ Intentos de fraude en la presentación del examen de admisión","\nPerdida de credibilidad",3,"Al menos una vez en los ultimos 2 años","34",4,"Mayor","Zona de Riesgo Extrema","E","Control Preventivo","Utilización de medios institucionales de comunicación alertando a los aspirantes sobre la transparencia del proceso de admisión","Semestral","Afecta la Probabilidad","Si",15,"Si",5,"No",0,"Si",10,"Si",15,"Si",10,"Si",30,85,"Disminuye la Probabilidad en 2",2,{"$f":"BD297","v":1},{"$f":"IF(AJ297=5,\"Mas de una vez al año\",IF(AJ297=4,\"Al menos una vez en el ultimo año\",IF(AJ297=3,\"Al menos una vez en los ultimos 2 años\",IF(AJ297=2,\"Al menos una vez en los ultimos 5 años\",\"No se ha presentado en los ultimos 5 años\"))))","v":"No se ha presentado en los ultimos 5 años"},{"$f":"BF297","v":4},{"$f":"IF(AL297=5,\"Catastrófico - Tendría desastrosas consecuencias o efectos sobre la institución\",IF(AL297=4,\"Mayor - Tendría altas consecuencias o efectos sobre la institución\",IF(AL297=3,\"Moderado - Tendría medianas consecuencias o efectos sobre la institución\",IF(AL297=2,\"Menos - Tendría bajo impacto o efecto sobre la institución\",IF(AL297=1,\"Insignificante - tendría consecuencias o efectos mínimos en la institución\",\"Digite Valor entre 1 y 5\")))))","v":"Mayor - Tendría altas consecuencias o efectos sobre la institución"},{"$f":"CONCATENATE(AJ297,AL297)","v":"14"},{"$f":"IF(COUNTIF($CE$10:$CE$17,AN297),$CE$9,IF(COUNTIF($CF$10:$CF$17,AN297),$CF$9,IF(COUNTIF($CG$10:$CG$13,AN297),$CG$9,IF(COUNTIF($CH$10:$CH$14,AN297),$CH$9,\"\"))))","v":"Zona de Riesgo Alta"},{"$f":"IF(AO297=$CE$9,\"E\",IF(AO297=$CF$9,\"A\",IF(AO297=$CG$9,\"M\",IF(AO297=$CH$9,\"B\",\"\"))))","v":"A"},"Existe un plan de medios  por parte d ela División de comunicaciones","Solicitar al Centro de comunicaciones antes de la aplicación del examen las recomendación a los aspirantes para evitar que incurrar en la utilizacion de mecanismos fraudulentos","Profesional Especializado DARCA\nProfesional Especializado División Comunicaciones","2016-01-01","2016-12-31","Emisiones radiales y de televión\n",3,2,4,"No aplica",null,8,0,1,null,4]
[null,{"$f":"B297+1","v":2},{"$nulls":4},"Afectación de imagen institucional",{"$nulls":7},"Control Preventivo","Revisión minuciosa del aspirante al ingreso y durante la presentación del examen","Semestral","Afecta la Probabilidad","Si",15,"Si",5,"No",0,"Si",10,"Si",15,"Si",10,"Si",30,85,"Disminuye la Probabilidad en 2",2,{"$nulls":14},2,null,"No aplica"]
[null,3,{"$nulls":12},"Control Preventivo","Toma de huellas","Semestral","Afecta la Probabilidad","Si",15,"Si",5,"No",0,"Si",10,"Si",15,"Si",10,"NO",0,55,"Disminuye la Probabilidad en 1",1,{"$nulls":7},"La toma de huella esta contratada con personal experto.",{"$nulls":6},1,null,"No aplica"]
[null,4,{"$nulls":12},"Control Preventivo","Controles de tipo tecnológico","Semestral","Afecta la Probabilidad","No",0,"Si",5,"No",0,"Si",10,"Si",15,"Si",10,"Si",30,70,"Disminuye la Probabilidad en 1",1,{"$nulls":14},1,null,"No aplica"]
[null,5,{"$nulls":12},"Control Preventivo","Acompañamiento durante la prueba de personal de CTI, Fiscalia, Policia, Ejercito entre otos","Semestral","Afecta la Probabilidad","Si",15,"Si",5,"No",0,"Si",10,"Si",15,"Si",10,"Si",30,85,"Disminuye la Probabilidad en 2",2,{"$nulls":14},2,null,"No aplica"]
[null,6,{"$nulls":17},0,null,0,null,0,null,0,null,0,null,0,null,0,0,"",0,{"$nulls":14},"No aplica",null,"No aplica"]
[null,7,{"$nulls":17},0,null,0,null,0,null,0,null,0,null,0,null,0,0,"",0,{"$nulls":14},"No aplica",null,"No aplica"]
[null,8,{"$nulls":17},0,null,0,null,0,null,0,null,0,null,0,null,0,0,"",0,{"$nulls":14},"No aplica",null,"No aplica"]
[null,9,{"$nulls":17},0,null,0,null,0,null,0,null,0,null,0,null,0,0,"",0,{"$nulls":14},"No aplica",null,"No aplica"]
["R34",1,"Factor_Interno","Comunicación interna","Desconocimiento de la legislación en salud ocupacional","La comunidad universitaria trabajadora,  no incorpora la  seguridad y  salud en el trabajo en sus actividades laborales","Sanciones al empleador\n",4,"Al menos una vez en el ultimo año","44",4,"Mayor","Zona de Riesgo Extrema","E","Control Preventivo"," Existen procedimientos que orientan al trabajador en materia de salud ocupacional ","Continuo","Afecta la Probabilidad","Si",15,"Si",5,"No",0,"Si",10,"Si",15,"Si",10,"Si",30,85,"Disminuye la Probabilidad en 2",2,{"$f":"BD306","v":1},{"$f":"IF(AJ306=5,\"Mas de una vez al año\",IF(AJ306=4,\"Al menos una vez en el ultimo año\",IF(AJ306=3,\"Al menos una vez en los ultimos 2 años\",IF(AJ306=2,\"Al menos una vez en los ultimos 5 años\",\"No se ha presentado en los ultimos 5 años\"))))","v":"No se ha presentado en los ultimos 5 años"},{"$f":"BF306","v":4},{"$f":"IF(AL306=5,\"Catastrófico - Tendría desastrosas consecuencias o efectos sobre la institución\",IF(AL306=4,\"Mayor - Tendría altas consecuencias o efectos sobre la institución\",IF(AL306=3,\"Moderado - Tendría medianas consecuencias o efectos sobre la institución\",IF(AL306=2,\"Menos - Tendría bajo impacto o efecto sobre la institución\",IF(AL306=1,\"Insignificante - tendría consecuencias o efectos mínimos en la institución\",\"Digite Valor entre 1 y 5\")))))","v":"Mayor - Tendría altas consecuencias o efectos sobre la institución"},{"$f":"CONCATENATE(AJ306,AL306)","v":"14"},{"$f":"IF(COUNTIF($CE$10:$CE$17,AN306),$CE$9,IF(COUNTIF($CF$10:$CF$17,AN306),$CF$9,IF(COUNTIF($CG$10:$CG$13,AN306),$CG$9,IF(COUNTIF($CH$10:$CH$14,AN306),$CH$9,\"\"))))","v":"Zona de Riesgo Alta"},{"$f":"IF(AO306=$CE$9,\"E\",IF(AO306=$CF$9,\"A\",IF(AO306=$CG$9,\"M\",IF(AO306=$CH$9,\"B\",\"\"))))","v":"A"},"Terminos acordes al Decreto 1072 de 2015 capitulo 2.2.2.4.6","Realizar mejoras  al  programa de capacitación con inclusión de inducción y reinducción","Director Area Salud Ocupacional\nEquipo de trabajo Salud Ocupacional","2015-05-01","2016-01-30","Formatos registro de asistencia",{"$f":"H306","v":4},2,{"$f":"K306","v":4},"No aplica",null,{"$f":"IF(R306=\"\",\"\",SUMIF(R306:R314,\"Afecta la Probabilidad\",AX306:AX314))","v":12},{"$f":"IF(R306=\"\",\"\",SUMIF(R306:R314,\"Afecta el Impacto\",AZ306:AZ314))","v":0},{"$f":"IF(BB306=\"\",\"\",IF(H306-BB306<=0,1,H306-BB306))","v":1},null,{"$f":"IF(K306=\"\",\"\",IF(K306-BC306<0,1,K306-BC306))","v":4}]
[null,{"$f":"B306+1","v":2},"Factor_Interno","Personal","Incumplimiento de los procedimientos establecidos por el área de salud ocupacional",null,"Detrimento de la salud del trabajador y del clima laboral",{"$nulls":7},"Control Preventivo","Talleres de riesgo psisocial","Continuo","Afecta la Probabilidad","Si",15,"Si",5,"No",0,"Si",10,"Si",15,"Si",10,"Si",30,85,"Disminuye la Probabilidad en 2",2,{"$nulls":8},"Socializar las actividades en materia de seguridad y salud en el trabajo ante los directivos universitarios","Director Area Salud Ocupacional\nEquipo de trabajo Salud Ocupacional","2015-05-01","2016-01-30","Comunidados web",null,2,null,"No aplica"]
[null,3,{"$nulls":4},"Disminución de la productividad laboral",{"$nulls":7},"Control Preventivo","Evaluaciones muscoloesqueleticas","Continuo","Afecta la Probabilidad","Si",15,"Si",5,"No",0,"Si",10,"Si",15,"Si",10,"Si",30,85,"Disminuye la Probabilidad en 2",2,{"$nulls":14},2,null,"No aplica"]
[null,4,{"$nulls":4},"Ausentismo laboral",{"$nulls":7},"Control Preventivo","Inspecciones ( Riesgo psicosocial, Higiene y seguridad insdustrial, Biomecánica)","A Solicitud","Afecta la Probabilidad","Si",15,"Si",5,"No",0,"Si",10,"Si",15,"Si",10,"Si",30,85,"Disminuye la Probabilidad en 2",2,{"$nulls":14},2,null,"No aplica"]
[null,5,{"$nulls":12},"Control Preventivo","Entrega Elementos de protección individual y colectiva","A Solicitud","Afecta la Probabilidad","Si",15,"Si",5,"No",0,"Si",10,"Si",15,"Si",10,"Si",30,85,"Disminuye la Probabilidad en 2",2,{"$nulls":14},2,null,"No aplica"]
[null,6,{"$nulls":12},"Control Preventivo","Evaluaciones médicas y pscicologicas","Anual","Afecta la Probabilidad","Si",15,"Si",5,"No",0,"Si",10,"Si",15,"Si",10,"Si",30,85,"Disminuye la Probabilidad en 2",2,{"$nulls":14},2,null,"No aplica"]
[null,7,{"$nulls":17},0,null,0,null,0,null,0,null,0,null,0,null,0,0,"",0,{"$nulls":14},"No aplica",null,"No aplica"]
[null,8,{"$nulls":17},0,null,0,null,0,null,0,null,0,null,0,null,0,0,"",0,{"$nulls":14},"No aplica",null,"No aplica"]
[null,9,{"$nulls":17},0,null,0,null,0,null,0,null,0,null,0,null,0,0,"",0,{"$nulls":14},"No aplica",null,"No aplica"]
["R35",1,"Factor_Interno","Financieros","Recursos inadecuados o insuficientes ( Fisicos, financieros, humanos)","Limitacion en la realización de los proyectos y/o actividades en pro de la calidad de vida  laboral","Sanciones para el empleador",4,"Al menos una vez en el ultimo año","44",4,"Mayor","Zona de Riesgo Extrema","E","Control Preventivo","Acuerdo  071 de 2005 ","Semestral","Afecta la Probabilidad","No",0,"Si",5,"No",0,"Si",10,"Si",15,"Si",10,"Si",30,70,"Disminuye la Probabilidad en 1",1,{"$f":"BD315","v":1},{"$f":"IF(AJ315=5,\"Mas de una vez al año\",IF(AJ315=4,\"Al menos una vez en el ultimo año\",IF(AJ315=3,\"Al menos una vez en los ultimos 2 años\",IF(AJ315=2,\"Al menos una vez en los ultimos 5 años\",\"No se ha presentado en los ultimos 5 años\"))))","v":"No se ha presentado en los ultimos 5 años"},{"$f":"BF315","v":4},{"$f":"IF(AL315=5,\"Catastrófico - Tendría desastrosas consecuencias o efectos sobre la institución\",IF(AL315=4,\"Mayor - Tendría altas consecuencias o efectos sobre la institución\",IF(AL315=3,\"Moderado - Tendría medianas consecuencias o efectos sobre la institución\",IF(AL315=2,\"Menos - Tendría bajo impacto o efecto sobre la institución\",IF(AL315=1,\"Insignificante - tendría consecuencias o efectos mínimos en la institución\",\"Digite Valor entre 1 y 5\")))))","v":"Mayor - Tendría altas consecuencias o efectos sobre la institución"},{"$f":"CONCATENATE(AJ315,AL315)","v":"14"},{"$f":"IF(COUNTIF($CE$10:$CE$17,AN315),$CE$9,IF(COUNTIF($CF$10:$CF$17,AN315),$CF$9,IF(COUNTIF($CG$10:$CG$13,AN315),$CG$9,IF(COUNTIF($CH$10:$CH$14,AN315),$CH$9,\"\"))))","v":"Zona de Riesgo Alta"},{"$f":"IF(AO315=$CE$9,\"E\",IF(AO315=$CF$9,\"A\",IF(AO315=$CG$9,\"M\",IF(AO315=$CH$9,\"B\",\"\"))))","v":"A"},"Crea el Area de Salud Ocupacional y define responsabilidades de intervención para directivos de cada dependencia","Gestionar ante la dirección a traves de la Vicerrectoría Administrativa- División Talento de Gestión del Humano la aplicación de lo normado en el Acuerdo  071 de 2005 y en el documento del programa, y demas normas nacionales que rigen al Sistema de Seguridad y Salud en el Trabajo","Director Area Salud Ocupacional\nEquipo de trabajo Salud Ocupacional","2016-01-01","2016-12-31","Solicitudes de pedidos \nRemisión de inspecciones\nCumplimiento de indicadores",4,1,4,"No aplica",null,5,0,1,null,4]
[null,{"$f":"B315+1","v":2},"Factor_Externo","Comunicación externa","Dificultades con la ARL en cuanto al apoyo asistencial y económico en casos de accidentes de trabajo y enfermedad laboral",null,"Detrimento de la salud del trabajador y del clima laboral",{"$nulls":7},"Control Preventivo","Sistema de seguridad y salud en el trabajo ( Programa de Salud Ocupacional)","Semestral","Afecta la Probabilidad","Si",15,"Si",5,"No",0,"Si",10,"Si",15,"Si",10,"Si",30,85,"Disminuye la Probabilidad en 2",2,{"$nulls":8},"Gestionar y pactar el cronograma anual  de actividades con la ARL","Director Area Salud Ocupacional\nEquipo de trabajo Salud Ocupacional","2016-01-01","2016-12-31","Plan de trabajo anual",null,2,null,"No aplica"]
[null,3,{"$nulls":4},"Disminucion de la productividad laboral",{"$nulls":7},"Control Preventivo","Cronogama actividades de  la Administradora de Riesgos Profesionales -ARL","Anual","Afecta la Probabilidad","Si",15,"Si",5,"No",0,"Si",10,"Si",15,"Si",10,"Si",30,85,"Disminuye la Probabilidad en 2",2,{"$nulls":7},"Se realizan avances trimestrales","Incorporar a los miembros del comité paritario de seguridad y salud en el trabajo en las actividades respectivas","Director Area Salud Ocupacional\nEquipo de trabajo Salud Ocupacional","2016-01-01","2016-12-31","Actas reuniones de COPASST\nActas de visita",null,2,null,"No aplica"]
[null,4,{"$nulls":4},"Aumento del ausentismo ",{"$nulls":12},0,null,0,null,0,null,0,null,0,null,0,null,0,0,"",0,{"$nulls":14},"No aplica",null,"No aplica"]
[null,5,{"$nulls":4},"Accidentalidad y enfermedad profesional",{"$nulls":12},0,null,0,null,0,null,0,null,0,null,0,null,0,0,"",0,{"$nulls":14},"No aplica",null,"No aplica"]
[null,6,{"$nulls":4},"Demandas",{"$nulls":12},0,null,0,null,0,null,0,null,0,null,0,null,0,0,"",0,{"$nulls":14},"No aplica",null,"No aplica"]
[null,7,{"$nulls":17},0,null,0,null,0,null,0,null,0,null,0,null,0,0,"",0,{"$nulls":14},"No aplica",null,"No aplica"]
[null,8,{"$nulls":17},0,null,0,null,0,null,0,null,0,null,0,null,0,0,"",0,{"$nulls":14},"No aplica",null,"No aplica"]
[null,9,{"$nulls":17},0,null,0,null,0,null,0,null,0,null,0,null,0,0,"",0,{"$nulls":14},"No aplica",null,"No aplica"]
["R36",1,"Factor_Interno","Personal","Mal uso  por parte de los usuarios\nrobos","Vulnerabilidad de la  información bibliográfica  impresa y digital","Detrimento del patrimonio Institucional y \nDocumental",3,"Al menos una vez en los ultimos 2 años","32",2,"Menos","Zona de Riesgo Moderada","M","Control Preventivo","Solicitud copias de seguridad a la Divisiòn de TICS","Continuo","Afecta la Probabilidad","Si",15,"Si",5,"No",0,"No",0,"Si",15,"Si",10,"Si",30,75,"Disminuye la Probabilidad en 1",1,{"$f":"BD324","v":1},{"$f":"IF(AJ324=5,\"Mas de una vez al año\",IF(AJ324=4,\"Al menos una vez en el ultimo año\",IF(AJ324=3,\"Al menos una vez en los ultimos 2 años\",IF(AJ324=2,\"Al menos una vez en los ultimos 5 años\",\"No se ha presentado en los ultimos 5 años\"))))","v":"No se ha presentado en los ultimos 5 años"},{"$f":"BF324","v":2},{"$f":"IF(AL324=5,\"Catastrófico - Tendría desastrosas consecuencias o efectos sobre la institución\",IF(AL324=4,\"Mayor - Tendría altas consecuencias o efectos sobre la institución\",IF(AL324=3,\"Moderado - Tendría medianas consecuencias o efectos sobre la institución\",IF(AL324=2,\"Menos - Tendría bajo impacto o efecto sobre la institución\",IF(AL324=1,\"Insignificante - tendría consecuencias o efectos mínimos en la institución\",\"Digite Valor entre 1 y 5\")))))","v":"Menos - Tendría bajo impacto o efecto sobre la institución"},{"$f":"CONCATENATE(AJ324,AL324)","v":"12"},{"$f":"IF(COUNTIF($CE$10:$CE$17,AN324),$CE$9,IF(COUNTIF($CF$10:$CF$17,AN324),$CF$9,IF(COUNTIF($CG$10:$CG$13,AN324),$CG$9,IF(COUNTIF($CH$10:$CH$14,AN324),$CH$9,\"\"))))","v":"Zona de Riesgo Baja"},{"$f":"IF(AO324=$CE$9,\"E\",IF(AO324=$CF$9,\"A\",IF(AO324=$CG$9,\"M\",IF(AO324=$CH$9,\"B\",\"\"))))","v":"B"},"Procedimiento a cargo de la Divisiòn de TICs, este genera reporte de la copias de seguridad","Reubicación de las colecciones ","Profesional Especializada  División de Recursos Bibliográficos\nEquipo de trabajo","2016-01-01","2016-12-31","Documento de solicitud de apoyo al Area de Mantenimietnto y Edificios, Fotografias",3,1,2,"No aplica",null,5,0,1,null,2]
[null,{"$f":"B324+1","v":2},"Factor_Externo","Medioambientales","Desastres naturales\n",null,"Disminución de la calidad del servicio",{"$nulls":7},"Control Preventivo","Mercadeo de servcios biblotecarios","Continuo","Afecta la Probabilidad","Si",15,"Si",5,"No",0,"Si",10,"Si",15,"Si",10,"Si",30,85,"Disminuye la Probabilidad en 2",2,{"$nulls":8},"Realización de inventarios periódicos","Profesional Especializada  División de Recursos Bibliográficos\nEquipo de trabajo","2016-01-01","2016-12-31","Reporte sistema Bibliográficos",null,2,null,"No aplica"]
[null,3,"Factor_Externo","Tecnológicos","Fallas en la tecnología",null,"Desgaste administrativo",{"$nulls":7},"Control Preventivo","Existen pólizas de seguridad ante eventos catastroficos ","Anual","Afecta la Probabilidad","Si",15,"Si",5,"No",0,"Si",10,"Si",15,"Si",10,"Si",30,85,"Disminuye la Probabilidad en 2",2,{"$nulls":7},"Las polizas son gestionadas por parte d ela Vicerrectoría administrativa","Implementar el uso de la  tarjeta inteligente para acceso a los servicios bibliográficos","Profesional Especializada  División de Recursos Bibliográficos\nEquipo de trabajo","2016-01-01","2016-12-31","Reporte del sistema de movilidad",null,2,null,"No aplica"]
[null,4,null,null,"Humedad, insectos, plagas, hongos",{"$nulls":14},0,null,0,null,0,null,0,null,0,null,0,null,0,0,"",0,{"$nulls":8},"Realizar mercadeo de los servicios dirigidos a toda la comunidad universitaria","Profesional Especializada  División de Recursos Bibliográficos\nEquipo de trabajo","2016-01-01","2016-12-31","Listas de asitencia\nRegistros fotograficos\nRegistros digitales",null,"No aplica",null,"No aplica"]
[null,5,{"$nulls":17},0,null,0,null,0,null,0,null,0,null,0,null,0,0,"",0,{"$nulls":14},"No aplica",null,"No aplica"]
[null,6,{"$nulls":17},0,null,0,null,0,null,0,null,0,null,0,null,0,0,"",0,{"$nulls":14},"No aplica",null,"No aplica"]
[null,7,{"$nulls":17},0,null,0,null,0,null,0,null,0,null,0,null,0,0,"",0,{"$nulls":14},"No aplica",null,"No aplica"]
[null,8,{"$nulls":17},0,null,0,null,0,null,0,null,0,null,0,null,0,0,"",0,{"$nulls":14},"No aplica",null,"No aplica"]
[null,9,{"$nulls":17},0,null,0,null,0,null,0,null,0,null,0,null,0,0,"",0,{"$nulls":14},"No aplica",null,"No aplica"]
["R37",1,"Factor_Interno","Personal","Desconocimiento del uso de  los recursos Bibliográficos","Subutilización,  desactualización y obsolescencia de los recursos  bibliográficos en línea e impresos.\n","Pérdida de patrimonio Institucional y documental ",3,"Al menos una vez en los ultimos 2 años","32",2,"Menos","Zona de Riesgo Moderada","M","Control Preventivo","Promociòn de los servicios bibliogràfcios en la Pagina Web ","Continuo","Afecta la Probabilidad","Si",15,"Si",5,"No",0,"Si",10,"Si",15,"Si",10,"Si",30,85,"Disminuye la Probabilidad en 2",2,{"$f":"BD333","v":1},{"$f":"IF(AJ333=5,\"Mas de una vez al año\",IF(AJ333=4,\"Al menos una vez en el ultimo año\",IF(AJ333=3,\"Al menos una vez en los ultimos 2 años\",IF(AJ333=2,\"Al menos una vez en los ultimos 5 años\",\"No se ha presentado en los ultimos 5 años\"))))","v":"No se ha presentado en los ultimos 5 años"},{"$f":"BF333","v":2},{"$f":"IF(AL333=5,\"Catastrófico - Tendría desastrosas consecuencias o efectos sobre la institución\",IF(AL333=4,\"Mayor - Tendría altas consecuencias o efectos sobre la institución\",IF(AL333=3,\"Moderado - Tendría medianas consecuencias o efectos sobre la institución\",IF(AL333=2,\"Menos - Tendría bajo impacto o efecto sobre la institución\",IF(AL333=1,\"Insignificante - tendría consecuencias o efectos mínimos en la institución\",\"Digite Valor entre 1 y 5\")))))","v":"Menos - Tendría bajo impacto o efecto sobre la institución"},{"$f":"CONCATENATE(AJ333,AL333)","v":"12"},{"$f":"IF(COUNTIF($CE$10:$CE$17,AN333),$CE$9,IF(COUNTIF($CF$10:$CF$17,AN333),$CF$9,IF(COUNTIF($CG$10:$CG$13,AN333),$CG$9,IF(COUNTIF($CH$10:$CH$14,AN333),$CH$9,\"\"))))","v":"Zona de Riesgo Baja"},{"$f":"IF(AO333=$CE$9,\"E\",IF(AO333=$CF$9,\"A\",IF(AO333=$CG$9,\"M\",IF(AO333=$CH$9,\"B\",\"\"))))","v":"B"},null,"Realizar un plan de promociones de los servicios ofrecidos ","Profesional Especializada  División de Recursos Bibliográficos\nEquipo de trabajo","2015-01-01","2015-12-31","Documento de l plan\nFotografias\nLista de asistencia",3,2,2,"No aplica",null,8,0,1,null,2]
[null,{"$f":"B333+1","v":2},"Factor_Interno","Tecnología","Nuevas alternativas  tecnológicas para recuperar informaciòn",null,"Bajas estadisticas de los servicios prestados ",{"$nulls":7},"Control Preventivo","Talleres permanentes de capacitación","Continuo","Afecta la Probabilidad","Si",15,"Si",5,"No",0,"Si",10,"Si",15,"Si",10,"Si",30,85,"Disminuye la Probabilidad en 2",2,{"$nulls":8},"Realizar Capacitaciones y uso de bases de datos Bibliogràfiicas  ","Profesional Especializada  División de Recursos Bibliográficos\nEquipo de trabajo","2015-01-01","2015-12-31","Fotografias\nLista de asistencia",null,2,null,"No aplica"]
[null,3,"Factor_Interno","Procesos","Actividades académicas desarticuladas con la biblioteca",null,"Utilización de fuentes bibliográficas irrelevantes ",{"$nulls":7},"Control Preventivo","Capacitación continua al personal de biblioteca ","Continuo","Afecta la Probabilidad","Si",15,"Si",5,"No",0,"Si",10,"Si",15,"Si",10,"Si",30,85,"Disminuye la Probabilidad en 2",2,{"$nulls":8},"Aplicación de la políticas de desarrollo de colecciones ","Profesional Especializada  División de Recursos Bibliográficos\nEquipo de trabajo","2015-01-01","2015-12-31","Documento de polìtica",null,2,null,"No aplica"]
[null,4,"Factor_Interno","Personal","Desinterés de los usuarios ",{"$nulls":9},"Control Preventivo","Aplicaciòn de medios para medir y controlar el grado de satisfacción de los usuarios ","Continuo","Afecta la Probabilidad","Si",15,"Si",5,"No",0,"Si",10,"Si",15,"Si",10,"Si",30,85,"Disminuye la Probabilidad en 2",2,{"$nulls":8},"Realizar analisis del reporte estadistico arrojado por el Sistema SIGMA","Profesional Especializada  División de Recursos Bibliográficos\nEquipo de trabajo","2015-01-01","2015-12-31","Reporte Estadisatico",null,2,null,"No aplica"]
[null,5,"Factor_Interno","Estratégicos","Presupuesto limitado para la adquisicòn y suscripciòn de material bibliogràfico",{"$nulls":14},0,null,0,null,0,null,0,null,0,null,0,null,0,0,"",0,{"$nulls":14},"No aplica",null,"No aplica"]
[null,6,{"$nulls":17},0,null,0,null,0,null,0,null,0,null,0,null,0,0,"",0,{"$nulls":14},"No aplica",null,"No aplica"]
[null,7,{"$nulls":17},0,null,0,null,0,null,0,null,0,null,0,null,0,0,"",0,{"$nulls":14},"No aplica",null,"No aplica"]
[null,8,{"$nulls":17},0,null,0,null,0,null,0,null,0,null,0,null,0,0,"",0,{"$nulls":14},"No aplica",null,"No aplica"]
[null,9,{"$nulls":17},0,null,0,null,0,null,0,null,0,null,0,null,0,0,"",0,{"$nulls":14},"No aplica",null,"No aplica"]
["R38",1,"Factor_Interno","Comunicación interna","Incumplimiento de los Procedimientos","Subestimación o sobreestimación de las partidas y  valores que conforman los Estados Económicos,Sociales y Ambientales de la Universidad","Sanciones",1,"No se ha presentado en los ultimos 5 años","13",3,"Moderado","Zona de Riesgo Moderada","M","Control Preventivo","Requerimientos  a las áreas que deben suministrar información para consolidar los Estados Económicos, Sociales y Ambientales de la Institución","Mensual","Afecta la Probabilidad","Si",15,"Si",5,"No",0,"Si",10,"Si",15,"Si",10,"Si",30,85,"Disminuye la Probabilidad en 2",2,{"$f":"BD342","v":1},{"$f":"IF(AJ342=5,\"Mas de una vez al año\",IF(AJ342=4,\"Al menos una vez en el ultimo año\",IF(AJ342=3,\"Al menos una vez en los ultimos 2 años\",IF(AJ342=2,\"Al menos una vez en los ultimos 5 años\",\"No se ha presentado en los ultimos 5 años\"))))","v":"No se ha presentado en los ultimos 5 años"},{"$f":"BF342","v":3},{"$f":"IF(AL342=5,\"Catastrófico - Tendría desastrosas consecuencias o efectos sobre la institución\",IF(AL342=4,\"Mayor - Tendría altas consecuencias o efectos sobre la institución\",IF(AL342=3,\"Moderado - Tendría medianas consecuencias o efectos sobre la institución\",IF(AL342=2,\"Menos - Tendría bajo impacto o efecto sobre la institución\",IF(AL342=1,\"Insignificante - tendría consecuencias o efectos mínimos en la institución\",\"Digite Valor entre 1 y 5\")))))","v":"Moderado - Tendría medianas consecuencias o efectos sobre la institución"},{"$f":"CONCATENATE(AJ342,AL342)","v":"13"},{"$f":"IF(COUNTIF($CE$10:$CE$17,AN342),$CE$9,IF(COUNTIF($CF$10:$CF$17,AN342),$CF$9,IF(COUNTIF($CG$10:$CG$13,AN342),$CG$9,IF(COUNTIF($CH$10:$CH$14,AN342),$CH$9,\"\"))))","v":"Zona de Riesgo Moderada"},{"$f":"IF(AO342=$CE$9,\"E\",IF(AO342=$CF$9,\"A\",IF(AO342=$CG$9,\"M\",IF(AO342=$CH$9,\"B\",\"\"))))","v":"M"},null,"Comunicaciones, requerimentos a las dependencias que deben suministrar información económica y social para la consolidación de los Estados Financieros, Económicos, Sociales y Ambientales","Profesional Universitario\nContador","2015-01-01","2015-12-31","EVIDENCIAS!!!!!",1,2,3,"No aplica",null,6,0,1,null,3]
[null,{"$f":"B342+1","v":2},"Factor_del_Proceso","Comunicación entre procesos","Comunicación Inoportuna",null,"Evaluaciones erradas",{"$nulls":7},"Control Preventivo","Reuniones de conciliación de Información","Mensual","Afecta la Probabilidad","Si",15,"Si",5,"No",0,"Si",10,"Si",15,"Si",10,"Si",30,85,"Disminuye la Probabilidad en 2",2,{"$nulls":14},2,null,"No aplica"]
[null,3,"Factor_del_Proceso","Procedimientos asociados","Falta de seguimiento y análisis",null,"Decisiones inadecuadas",{"$nulls":7},"Control Preventivo","Oficios de Observaciones a la información recibida","Mensual","Afecta la Probabilidad","Si",15,"Si",5,"No",0,"Si",10,"Si",15,"Si",10,"Si",30,85,"Disminuye la Probabilidad en 2",2,{"$nulls":14},2,null,"No aplica"]
[null,4,{"$nulls":4},"Pérdida de credibilidad",{"$nulls":12},0,null,0,null,0,null,0,null,0,null,0,null,0,0,"",0,{"$nulls":14},"No aplica",null,"No aplica"]
[null,5,{"$nulls":17},0,null,0,null,0,null,0,null,0,null,0,null,0,0,"",0,{"$nulls":14},"No aplica",null,"No aplica"]
[null,6,{"$nulls":17},0,null,0,null,0,null,0,null,0,null,0,null,0,0,"",0,{"$nulls":14},"No aplica",null,"No aplica"]
[null,7,{"$nulls":17},0,null,0,null,0,null,0,null,0,null,0,null,0,0,"",0,{"$nulls":14},"No aplica",null,"No aplica"]
[null,8,{"$nulls":17},0,null,0,null,0,null,0,null,0,null,0,null,0,0,"",0,{"$nulls":14},"No aplica",null,"No aplica"]
[null,9,{"$nulls":17},0,null,0,null,0,null,0,null,0,null,0,null,0,0,"",0,{"$nulls":14},"No aplica",null,"No aplica"]
["R39",1,"Factor_del_Proceso","Procedimientos asociados","Incumplimiento de procedimientos\n","Tramitar  en forma errada los documentos que sustentan las erogaciones institucionales como son: certificados de disponibilidad presupuestal, registros presupuestales, ordenes de pago, comprobantes de egreso y entrega del pago propiamente dicho ","Sanciones",1,"No se ha presentado en los ultimos 5 años","13",3,"Moderado","Zona de Riesgo Moderada","M","Control Preventivo","Asinación de funciones independientes, según el trámite,","Continuo","Afecta la Probabilidad","Si",15,"Si",5,"No",0,"Si",10,"Si",15,"Si",10,"Si",30,85,"Disminuye la Probabilidad en 2",2,{"$f":"BD351","v":1},{"$f":"IF(AJ351=5,\"Mas de una vez al año\",IF(AJ351=4,\"Al menos una vez en el ultimo año\",IF(AJ351=3,\"Al menos una vez en los ultimos 2 años\",IF(AJ351=2,\"Al menos una vez en los ultimos 5 años\",\"No se ha presentado en los ultimos 5 años\"))))","v":"No se ha presentado en los ultimos 5 años"},{"$f":"BF351","v":3},{"$f":"IF(AL351=5,\"Catastrófico - Tendría desastrosas consecuencias o efectos sobre la institución\",IF(AL351=4,\"Mayor - Tendría altas consecuencias o efectos sobre la institución\",IF(AL351=3,\"Moderado - Tendría medianas consecuencias o efectos sobre la institución\",IF(AL351=2,\"Menos - Tendría bajo impacto o efecto sobre la institución\",IF(AL351=1,\"Insignificante - tendría consecuencias o efectos mínimos en la institución\",\"Digite Valor entre 1 y 5\")))))","v":"Moderado - Tendría medianas consecuencias o efectos sobre la institución"},{"$f":"CONCATENATE(AJ351,AL351)","v":"13"},{"$f":"IF(COUNTIF($CE$10:$CE$17,AN351),$CE$9,IF(COUNTIF($CF$10:$CF$17,AN351),$CF$9,IF(COUNTIF($CG$10:$CG$13,AN351),$CG$9,IF(COUNTIF($CH$10:$CH$14,AN351),$CH$9,\"\"))))","v":"Zona de Riesgo Moderada"},{"$f":"IF(AO351=$CE$9,\"E\",IF(AO351=$CF$9,\"A\",IF(AO351=$CG$9,\"M\",IF(AO351=$CH$9,\"B\",\"\"))))","v":"M"},null,"Revisión de la Información  y soportes suministrados para la expedición de certificados , registros presupuestales, ordenes de pago, comprobantes de egreso","Profesional Universitario de Presupuesto y Tesorerìa, Tecnicos Administrativo según susn fuiones ","2015-01-01","2015-12-31","Archivo de glosas de devolución  que reposan en la División Financiera",1,2,3,"No aplica",null,8,0,1,null,3]
[null,{"$f":"B351+1","v":2},"Factor_Interno","Personal","Error en la digitación de datos",null,"Disminución de la calidad del servicio",{"$nulls":7},"Control Preventivo","Asignación de usuarios y roles por tipo de actividad","Continuo","Afecta la Probabilidad","Si",15,"Si",5,"No",0,"Si",10,"Si",15,"Si",10,"Si",30,85,"Disminuye la Probabilidad en 2",2,{"$nulls":8},"Verificación de los soportes para la aplicación de deducciones de ley","Profesional Universitario -Tesorero","2015-01-01","2015-12-31","Número de comprobantes de egreso.",null,2,null,"No aplica"]
[null,3,"Factor_Interno","Tecnología","Fallas en la Técnología",null,"Detrimento patrimonial",{"$nulls":7},"Control Preventivo","No aceptación de formatos diligenciados con enmendaduras, tachaduras y en forma tardía","Continuo","Afecta la Probabilidad","Si",15,"Si",5,"No",0,"Si",10,"Si",15,"Si",10,"Si",30,85,"Disminuye la Probabilidad en 2",2,{"$nulls":14},{"$f":"IF(R353=\"Afecta la Probabilidad\",AW353-(AW353-AI353),\"No aplica\")","v":2},null,{"$f":"IF(R353=\"Afecta el Impacto\",AY353-(AY353-AI353),\"No aplica\")","v":"No aplica"}]
[null,4,"Factor_Interno","Personal","Falta analisis de las solicitudes recibidos",{"$nulls":9},"Control Preventivo","Verificación de solicitudes, requsitos, cumplimiento de la normatividad en la presentación de los documentos  que soportes el trámite de egresos.","Continuo","Afecta la Probabilidad","Si",15,"Si",5,"No",0,"Si",10,"Si",15,"Si",10,"Si",30,85,"Disminuye la Probabilidad en 2",2,{"$nulls":14},2,null,"No aplica"]
[null,5,{"$nulls":17},0,null,0,null,0,null,0,null,0,null,0,null,0,0,"",0,{"$nulls":14},"No aplica",null,"No aplica"]
[null,6,{"$nulls":17},0,null,0,null,0,null,0,null,0,null,0,null,0,0,"",0,{"$nulls":14},"No aplica",null,"No aplica"]
[null,7,{"$nulls":17},0,null,0,null,0,null,0,null,0,null,0,null,0,0,"",0,{"$nulls":14},"No aplica",null,"No aplica"]
[null,8,{"$nulls":17},0,null,0,null,0,null,0,null,0,null,0,null,0,0,"",0,{"$nulls":14},"No aplica",null,"No aplica"]
[null,9,{"$nulls":17},0,null,0,null,0,null,0,null,0,null,0,null,0,0,"",0,{"$nulls":14},"No aplica",null,"No aplica"]
["R40",1,{"$nulls":6},{"$f":"IF(H360=5,\"Mas de una vez al año\",IF(H360=4,\"Al menos una vez en el ultimo año\",IF(H360=3,\"Al menos una vez en los ultimos 2 años\",IF(H360=2,\"Al menos una vez en los ultimos 5 años\",\"No se ha presentado en los ultimos 5 años\"))))","v":"No se ha presentado en los ultimos 5 años"},{"$f":"CONCATENATE(H$360,K$360)","v":""},null,{"$f":"IF(K360=5,\"Catastrófico\",IF(K360=4,\"Mayor\",IF(K360=3,\"Moderado\",IF(K360=2,\"Menos\",IF(K360=1,\"Insignificante\",\"Digite Valor entre 1 y 5\")))))","v":"Digite Valor entre 1 y 5"},{"$f":"IF(L360=\"Digite Valor entre 1 y 5\",\"\",IF(COUNTIF(CE$10:CE$17,CONCATENATE(H360,K360)),CE$9,IF(COUNTIF(CF$10:CF$17,CONCATENATE(H360,K360)),CF$9,IF(COUNTIF(CG$10:CG$13,CONCATENATE(H360,K360)),CG$9,CH$9))))","v":""},{"$f":"IF(M360=CE$9,\"E\",IF(M360=CF$9,\"A\",IF(M360=CG$9,\"M\",IF(M360=CH$9,\"B\",\"\"))))","v":""},{"$nulls":5},{"$f":"IF(S360=\"Si\",15,0)","v":0},null,{"$f":"IF(U360=\"Si\",5,0)","v":0},null,{"$f":"IF(W360=\"Si\",15,0)","v":0},null,{"$f":"IF(Y360=\"Si\",10,0)","v":0},null,{"$f":"IF(AA360=\"Si\",15,0)","v":0},null,{"$f":"IF(AC360=\"Si\",10,0)","v":0},null,{"$f":"IF(AE360=\"Si\",30,0)","v":0},{"$f":"T360+V360+X360+Z360+AB360+AD360+AF360","v":0},{"$f":"IF(R360=\"\",\"\",IF(R360=\"Afecta la Probabilidad\",IF(AND(AG360>=0,AG360<=50),\"No disminuye la Probabilidad\",IF(AND(AG360>50,AG360<=75),\"Disminuye la Probabilidad en 1\",IF(AND(AG360>75,AG360<=100),\"Disminuye la Probabilidad en 2\",\"\"))),IF(AND(AG360>=0,AG360<=50),\"No disminuye el Impacto\",IF(AND(AG360>50,AG360<=75),\"Disminuye el Impacto en 1\",IF(AND(AG360>75,AG360<=100),\"Disminuye el Impacto en 2\",\"\")))))","v":""},{"$f":"IF(AG360<=50,0,IF(AND(AG360>50,AG360<=75),1,IF(AND(AG360>75,AG360<=100),2,\"\")))","v":0},{"$f":"BD360","v":""},{"$nulls":12},0,"No aplica",0,"No aplica",null,"","","",null,""]
[null,{"$f":"B360+1","v":2},{"$nulls":17},0,null,0,null,0,null,0,null,0,null,0,null,0,0,{"$f":"IF(R361=\"\",\"\",IF(R361=\"Afecta la Probabilidad\",IF(AND(AG361>=0,AG361<=50),\"No disminuye la Probabilidad\",IF(AND(AG361>50,AG361<=75),\"Disminuye la Probabilidad en 1\",IF(AND(AG361>75,AG361<=100),\"Disminuye la Probabilidad en 2\",\"\"))),IF(AND(AG361>=0,AG361<=50),\"No disminuye el Impacto\",IF(AND(AG361>50,AG361<=75),\"Disminuye el Impacto en 1\",IF(AND(AG361>75,AG361<=100),\"Disminuye el Impacto en 2\",\"\")))))","v":""},0,{"$nulls":14},"No aplica",null,"No aplica"]
[null,3,{"$nulls":17},0,null,0,null,0,null,0,null,0,null,0,null,0,0,{"$f":"IF(R362=\"\",\"\",IF(R362=\"Afecta la Probabilidad\",IF(AND(AG362>=0,AG362<=50),\"No disminuye la Probabilidad\",IF(AND(AG362>50,AG362<=75),\"Disminuye la Probabilidad en 1\",IF(AND(AG362>75,AG362<=100),\"Disminuye la Probabilidad en 2\",\"\"))),IF(AND(AG362>=0,AG362<=50),\"No disminuye el Impacto\",IF(AND(AG362>50,AG362<=75),\"Disminuye el Impacto en 1\",IF(AND(AG362>75,AG362<=100),\"Disminuye el Impacto en 2\",\"\")))))","v":""},0,{"$nulls":14},"No aplica",null,"No aplica"]
[null,4,{"$nulls":17},0,null,0,null,0,null,0,null,0,null,0,null,0,0,{"$f":"IF(R363=\"\",\"\",IF(R363=\"Afecta la Probabilidad\",IF(AND(AG363>=0,AG363<=50),\"No disminuye la Probabilidad\",IF(AND(AG363>50,AG363<=75),\"Disminuye la Probabilidad en 1\",IF(AND(AG363>75,AG363<=100),\"Disminuye la Probabilidad en 2\",\"\"))),IF(AND(AG363>=0,AG363<=50),\"No disminuye el Impacto\",IF(AND(AG363>50,AG363<=75),\"Disminuye el Impacto en 1\",IF(AND(AG363>75,AG363<=100),\"Disminuye el Impacto en 2\",\"\")))))","v":""},0,{"$nulls":14},"No aplica",null,"No aplica"]
[null,5,{"$nulls":17},0,null,0,null,0,null,0,null,0,null,0,null,0,0,{"$f":"IF(R364=\"\",\"\",IF(R364=\"Afecta la Probabilidad\",IF(AND(AG364>=0,AG364<=50),\"No disminuye la Probabilidad\",IF(AND(AG364>50,AG364<=75),\"Disminuye la Probabilidad en 1\",IF(AND(AG364>75,AG364<=100),\"Disminuye la Probabilidad en 2\",\"\"))),IF(AND(AG364>=0,AG364<=50),\"No disminuye el Impacto\",IF(AND(AG364>50,AG364<=75),\"Disminuye el Impacto en 1\",IF(AND(AG364>75,AG364<=100),\"Disminuye el Impacto en 2\",\"\")))))","v":""},0,{"$nulls":14},"No aplica",null,"No aplica"]
[null,6,{"$nulls":17},0,null,0,null,0,null,0,null,0,null,0,null,0,0,"",0,{"$nulls":14},"No aplica",null,"No aplica"]
[null,7,{"$nulls":17},0,null,0,null,0,null,0,null,0,null,0,null,0,0,"",0,{"$nulls":14},"No aplica",null,"No aplica"]
[null,8,{"$nulls":17},0,null,0,null,0,null,0,null,0,null,0,null,0,0,"",0,{"$nulls":14},"No aplica",null,"No aplica"]
[null,9,{"$nulls":17},0,null,0,null,0,null,0,null,0,null,0,null,0,0,"",0,{"$nulls":14},"No aplica",null,"No aplica"]
["R41",1,{"$nulls":6},{"$f":"IF(H369=5,\"Mas de una vez al año\",IF(H369=4,\"Al menos una vez en el ultimo año\",IF(H369=3,\"Al menos una vez en los ultimos 2 años\",IF(H369=2,\"Al menos una vez en los ultimos 5 años\",\"No se ha presentado en los ultimos 5 años\"))))","v":"No se ha presentado en los ultimos 5 años"},{"$f":"CONCATENATE(H$369,K$369)","v":""},null,{"$f":"IF(K369=5,\"Catastrófico\",IF(K369=4,\"Mayor\",IF(K369=3,\"Moderado\",IF(K369=2,\"Menos\",IF(K369=1,\"Insignificante\",\"Digite Valor entre 1 y 5\")))))","v":"Digite Valor entre 1 y 5"},"",{"$f":"IF(M369=CE$9,\"E\",IF(M369=CF$9,\"A\",IF(M369=CG$9,\"M\",IF(M369=CH$9,\"B\",\"\"))))","v":""},{"$nulls":5},0,null,0,null,0,null,0,null,0,null,0,null,0,0,"",0,{"$f":"BD369","v":""},{"$nulls":12},0,"No aplica",0,"No aplica",null,"","","",null,""]
[null,{"$f":"B369+1","v":2},{"$nulls":17},0,null,0,null,0,null,0,null,0,null,0,null,0,0,{"$f":"IF(R370=\"\",\"\",IF(R370=\"Afecta la Probabilidad\",IF(AND(AG370>=0,AG370<=50),\"No disminuye la Probabilidad\",IF(AND(AG370>50,AG370<=75),\"Disminuye la Probabilidad en 1\",IF(AND(AG370>75,AG370<=100),\"Disminuye la Probabilidad en 2\",\"\"))),IF(AND(AG370>=0,AG370<=50),\"No disminuye el Impacto\",IF(AND(AG370>50,AG370<=75),\"Disminuye el Impacto en 1\",IF(AND(AG370>75,AG370<=100),\"Disminuye el Impacto en 2\",\"\")))))","v":""},0,{"$nulls":14},"No aplica",null,"No aplica"]
[null,3,{"$nulls":17},{"$f":"IF(S371=\"Si\",15,0)","v":0},null,{"$f":"IF(U371=\"Si\",5,0)","v":0},null,{"$f":"IF(W371=\"Si\",15,0)","v":0},null,{"$f":"IF(Y371=\"Si\",10,0)","v":0},null,{"$f":"IF(AA371=\"Si\",15,0)","v":0},null,{"$f":"IF(AC371=\"Si\",10,0)","v":0},null,{"$f":"IF(AE371=\"Si\",30,0)","v":0},{"$f":"T371+V371+X371+Z371+AB371+AD371+AF371","v":0},{"$f":"IF(R371=\"\",\"\",IF(R371=\"Afecta la Probabilidad\",IF(AND(AG371>=0,AG371<=50),\"No disminuye la Probabilidad\",IF(AND(AG371>50,AG371<=75),\"Disminuye la Probabilidad en 1\",IF(AND(AG371>75,AG371<=100),\"Disminuye la Probabilidad en 2\",\"\"))),IF(AND(AG371>=0,AG371<=50),\"No disminuye el Impacto\",IF(AND(AG371>50,AG371<=75),\"Disminuye el Impacto en 1\",IF(AND(AG371>75,AG371<=100),\"Disminuye el Impacto en 2\",\"\")))))","v":""},{"$f":"IF(AG371<=50,0,IF(AND(AG371>50,AG371<=75),1,IF(AND(AG371>75,AG371<=100),2,\"\")))","v":0},{"$nulls":14},"No aplica",null,"No aplica"]
[null,4,{"$nulls":17},0,null,0,null,0,null,0,null,0,null,0,null,0,0,{"$f":"IF(R372=\"\",\"\",IF(R372=\"Afecta la Probabilidad\",IF(AND(AG372>=0,AG372<=50),\"No disminuye la Probabilidad\",IF(AND(AG372>50,AG372<=75),\"Disminuye la Probabilidad en 1\",IF(AND(AG372>75,AG372<=100),\"Disminuye la Probabilidad en 2\",\"\"))),IF(AND(AG372>=0,AG372<=50),\"No disminuye el Impacto\",IF(AND(AG372>50,AG372<=75),\"Disminuye el Impacto en 1\",IF(AND(AG372>75,AG372<=100),\"Disminuye el Impacto en 2\",\"\")))))","v":""},0,{"$nulls":14},"No aplica",null,"No aplica"]
[null,5,{"$nulls":17},0,null,0,null,0,null,0,null,0,null,0,null,0,0,{"$f":"IF(R373=\"\",\"\",IF(R373=\"Afecta la Probabilidad\",IF(AND(AG373>=0,AG373<=50),\"No disminuye la Probabilidad\",IF(AND(AG373>50,AG373<=75),\"Disminuye la Probabilidad en 1\",IF(AND(AG373>75,AG373<=100),\"Disminuye la Probabilidad en 2\",\"\"))),IF(AND(AG373>=0,AG373<=50),\"No disminuye el Impacto\",IF(AND(AG373>50,AG373<=75),\"Disminuye el Impacto en 1\",IF(AND(AG373>75,AG373<=100),\"Disminuye el Impacto en 2\",\"\")))))","v":""},0,{"$nulls":14},"No aplica",null,"No aplica"]
[null,6,{"$nulls":17},0,null,0,null,0,null,0,null,0,null,0,null,0,0,"",0,{"$nulls":14},"No aplica",null,"No aplica"]
[null,7,{"$nulls":17},0,null,0,null,0,null,0,null,0,null,0,null,0,0,"",0,{"$nulls":14},"No aplica",null,"No aplica"]
[null,8,{"$nulls":17},0,null,0,null,0,null,0,null,0,null,0,null,0,0,"",0,{"$nulls":14},"No aplica",null,"No aplica"]
[null,9,{"$nulls":17},0,null,0,null,0,null,0,null,0,null,0,null,0,0,"",0,{"$nulls":14},"No aplica",null,"No aplica"]
["R42",1,{"$nulls":6},{"$f":"IF(H378=5,\"Mas de una vez al año\",IF(H378=4,\"Al menos una vez en el ultimo año\",IF(H378=3,\"Al menos una vez en los ultimos 2 años\",IF(H378=2,\"Al menos una vez en los ultimos 5 años\",\"No se ha presentado en los ultimos 5 años\"))))","v":"No se ha presentado en los ultimos 5 años"},{"$f":"CONCATENATE(H$378,K$378)","v":""},null,{"$f":"IF(K378=5,\"Catastrófico\",IF(K378=4,\"Mayor\",IF(K378=3,\"Moderado\",IF(K378=2,\"Menos\",IF(K378=1,\"Insignificante\",\"Digite Valor entre 1 y 5\")))))","v":"Digite Valor entre 1 y 5"},{"$f":"IF(L378=\"Digite Valor entre 1 y 5\",\"\",IF(COUNTIF(CE$10:CE$17,CONCATENATE(H378,K378)),CE$9,IF(COUNTIF(CF$10:CF$17,CONCATENATE(H378,K378)),CF$9,IF(COUNTIF(CG$10:CG$13,CONCATENATE(H378,K378)),CG$9,CH$9))))","v":""},{"$f":"IF(M378=CE$9,\"E\",IF(M378=CF$9,\"A\",IF(M378=CG$9,\"M\",IF(M378=CH$9,\"B\",\"\"))))","v":""},{"$nulls":5},0,null,0,null,0,null,0,null,0,null,0,null,0,0,"",0,{"$nulls":13},{"$f":"H378","v":0},"No aplica",{"$f":"K378","v":0},"No aplica",null,{"$f":"IF(R378=\"\",\"\",SUMIF(R378:R386,\"Afecta la Probabilidad\",AX378:AX386))","v":""},{"$f":"IF(R378=\"\",\"\",SUMIF(R378:R386,\"Afecta el Impacto\",AZ378:AZ386))","v":""},{"$f":"IF(BB378=\"\",\"\",IF(H378-BB378<=0,1,H378-BB378))","v":""},null,{"$f":"IF(K378=\"\",\"\",IF(K378-BC378<0,1,K378-BC378))","v":""}]
[null,{"$f":"B378+1","v":2},{"$nulls":17},0,null,0,null,0,null,0,null,0,null,0,null,0,0,{"$f":"IF(R379=\"\",\"\",IF(R379=\"Afecta la Probabilidad\",IF(AND(AG379>=0,AG379<=50),\"No disminuye la Probabilidad\",IF(AND(AG379>50,AG379<=75),\"Disminuye la Probabilidad en 1\",IF(AND(AG379>75,AG379<=100),\"Disminuye la Probabilidad en 2\",\"\"))),IF(AND(AG379>=0,AG379<=50),\"No disminuye el Impacto\",IF(AND(AG379>50,AG379<=75),\"Disminuye el Impacto en 1\",IF(AND(AG379>75,AG379<=100),\"Disminuye el Impacto en 2\",\"\")))))","v":""},0,{"$nulls":14},"No aplica",null,"No aplica"]
[null,3,{"$nulls":17},0,null,0,null,0,null,0,null,0,null,0,null,0,0,{"$f":"IF(R380=\"\",\"\",IF(R380=\"Afecta la Probabilidad\",IF(AND(AG380>=0,AG380<=50),\"No disminuye la Probabilidad\",IF(AND(AG380>50,AG380<=75),\"Disminuye la Probabilidad en 1\",IF(AND(AG380>75,AG380<=100),\"Disminuye la Probabilidad en 2\",\"\"))),IF(AND(AG380>=0,AG380<=50),\"No disminuye el Impacto\",IF(AND(AG380>50,AG380<=75),\"Disminuye el Impacto en 1\",IF(AND(AG380>75,AG380<=100),\"Disminuye el Impacto en 2\",\"\")))))","v":""},0,{"$nulls":14},"No aplica",null,"No aplica"]
[null,4,{"$nulls":17},0,null,0,null,0,null,0,null,0,null,0,null,0,0,{"$f":"IF(R381=\"\",\"\",IF(R381=\"Afecta la Probabilidad\",IF(AND(AG381>=0,AG381<=50),\"No disminuye la Probabilidad\",IF(AND(AG381>50,AG381<=75),\"Disminuye la Probabilidad en 1\",IF(AND(AG381>75,AG381<=100),\"Disminuye la Probabilidad en 2\",\"\"))),IF(AND(AG381>=0,AG381<=50),\"No disminuye el Impacto\",IF(AND(AG381>50,AG381<=75),\"Disminuye el Impacto en 1\",IF(AND(AG381>75,AG381<=100),\"Disminuye el Impacto en 2\",\"\")))))","v":""},0,{"$nulls":14},"No aplica",null,"No aplica"]
[null,5,{"$nulls":17},0,null,0,null,0,null,0,null,0,null,0,null,0,0,{"$f":"IF(R382=\"\",\"\",IF(R382=\"Afecta la Probabilidad\",IF(AND(AG382>=0,AG382<=50),\"No disminuye la Probabilidad\",IF(AND(AG382>50,AG382<=75),\"Disminuye la Probabilidad en 1\",IF(AND(AG382>75,AG382<=100),\"Disminuye la Probabilidad en 2\",\"\"))),IF(AND(AG382>=0,AG382<=50),\"No disminuye el Impacto\",IF(AND(AG382>50,AG382<=75),\"Disminuye el Impacto en 1\",IF(AND(AG382>75,AG382<=100),\"Disminuye el Impacto en 2\",\"\")))))","v":""},0,{"$nulls":14},"No aplica",null,"No aplica"]
[null,6,{"$nulls":17},0,null,0,null,0,null,0,null,0,null,0,null,0,0,"",0,{"$nulls":14},"No aplica",null,"No aplica"]
[null,7,{"$nulls":17},0,null,0,null,0,null,0,null,0,null,0,null,0,0,"",0,{"$nulls":14},"No aplica",null,"No aplica"]
[null,8,{"$nulls":17},0,null,0,null,0,null,0,null,0,null,0,null,0,0,"",0,{"$nulls":14},"No aplica",null,"No aplica"]
[null,9,{"$nulls":17},0,null,0,null,0,null,0,null,0,null,0,null,0,0,"",0,{"$nulls":14},"No aplica",null,"No aplica"]
["R43",1,{"$nulls":6},{"$f":"IF(H387=5,\"Mas de una vez al año\",IF(H387=4,\"Al menos una vez en el ultimo año\",IF(H387=3,\"Al menos una vez en los ultimos 2 años\",IF(H387=2,\"Al menos una vez en los ultimos 5 años\",\"No se ha presentado en los ultimos 5 años\"))))","v":"No se ha presentado en los ultimos 5 años"},{"$f":"CONCATENATE(H$387,K$387)","v":""},null,{"$f":"IF(K387=5,\"Catastrófico\",IF(K387=4,\"Mayor\",IF(K387=3,\"Moderado\",IF(K387=2,\"Menos\",IF(K387=1,\"Insignificante\",\"Digite Valor entre 1 y 5\")))))","v":"Digite Valor entre 1 y 5"},"",{"$f":"IF(M387=CE$9,\"E\",IF(M387=CF$9,\"A\",IF(M387=CG$9,\"M\",IF(M387=CH$9,\"B\",\"\"))))","v":""},{"$nulls":5},0,null,0,null,0,null,0,null,0,null,0,null,0,0,"",0,{"$nulls":13},0,"No aplica",0,"No aplica",null,"","","",null,""]
[null,{"$f":"B387+1","v":2},{"$nulls":17},0,null,0,null,0,null,0,null,0,null,0,null,0,0,{"$f":"IF(R388=\"\",\"\",IF(R388=\"Afecta la Probabilidad\",IF(AND(AG388>=0,AG388<=50),\"No disminuye la Probabilidad\",IF(AND(AG388>50,AG388<=75),\"Disminuye la Probabilidad en 1\",IF(AND(AG388>75,AG388<=100),\"Disminuye la Probabilidad en 2\",\"\"))),IF(AND(AG388>=0,AG388<=50),\"No disminuye el Impacto\",IF(AND(AG388>50,AG388<=75),\"Disminuye el Impacto en 1\",IF(AND(AG388>75,AG388<=100),\"Disminuye el Impacto en 2\",\"\")))))","v":""},0,{"$nulls":14},"No aplica",null,"No aplica"]
[null,3,{"$nulls":17},0,null,0,null,0,null,0,null,0,null,0,null,0,0,{"$f":"IF(R389=\"\",\"\",IF(R389=\"Afecta la Probabilidad\",IF(AND(AG389>=0,AG389<=50),\"No disminuye la Probabilidad\",IF(AND(AG389>50,AG389<=75),\"Disminuye la Probabilidad en 1\",IF(AND(AG389>75,AG389<=100),\"Disminuye la Probabilidad en 2\",\"\"))),IF(AND(AG389>=0,AG389<=50),\"No disminuye el Impacto\",IF(AND(AG389>50,AG389<=75),\"Disminuye el Impacto en 1\",IF(AND(AG389>75,AG389<=100),\"Disminuye el Impacto en 2\",\"\")))))","v":""},0,{"$nulls":14},"No aplica",null,"No aplica"]
[null,4,{"$nulls":17},0,null,0,null,0,null,0,null,0,null,0,null,0,0,{"$f":"IF(R390=\"\",\"\",IF(R390=\"Afecta la Probabilidad\",IF(AND(AG390>=0,AG390<=50),\"No disminuye la Probabilidad\",IF(AND(AG390>50,AG390<=75),\"Disminuye la Probabilidad en 1\",IF(AND(AG390>75,AG390<=100),\"Disminuye la Probabilidad en 2\",\"\"))),IF(AND(AG390>=0,AG390<=50),\"No disminuye el Impacto\",IF(AND(AG390>50,AG390<=75),\"Disminuye el Impacto en 1\",IF(AND(AG390>75,AG390<=100),\"Disminuye el Impacto en 2\",\"\")))))","v":""},0,{"$nulls":14},"No aplica",null,"No aplica"]
[null,5,{"$nulls":17},0,null,0,null,0,null,0,null,0,null,0,null,0,0,{"$f":"IF(R391=\"\",\"\",IF(R391=\"Afecta la Probabilidad\",IF(AND(AG391>=0,AG391<=50),\"No disminuye la Probabilidad\",IF(AND(AG391>50,AG391<=75),\"Disminuye la Probabilidad en 1\",IF(AND(AG391>75,AG391<=100),\"Disminuye la Probabilidad en 2\",\"\"))),IF(AND(AG391>=0,AG391<=50),\"No disminuye el Impacto\",IF(AND(AG391>50,AG391<=75),\"Disminuye el Impacto en 1\",IF(AND(AG391>75,AG391<=100),\"Disminuye el Impacto en 2\",\"\")))))","v":""},0,{"$nulls":14},"No aplica",null,"No aplica"]
[null,6,{"$nulls":17},0,null,0,null,0,null,0,null,0,null,0,null,0,0,"",0,{"$nulls":14},"No aplica",null,"No aplica"]
[null,7,{"$nulls":17},0,null,0,null,0,null,0,null,0,null,0,null,0,0,"",0,{"$nulls":14},"No aplica",null,"No aplica"]
[null,8,{"$nulls":17},0,null,0,null,0,null,0,null,0,null,0,null,0,0,"",0,{"$nulls":14},"No aplica",null,"No aplica"]
[null,9,{"$nulls":17},0,null,0,null,0,null,0,null,0,null,0,null,0,0,"",0,{"$nulls":14},"No aplica",null,"No aplica"]
["R44",1,{"$nulls":6},{"$f":"IF(H396=5,\"Mas de una vez al año\",IF(H396=4,\"Al menos una vez en el ultimo año\",IF(H396=3,\"Al menos una vez en los ultimos 2 años\",IF(H396=2,\"Al menos una vez en los ultimos 5 años\",\"No se ha presentado en los ultimos 5 años\"))))","v":"No se ha presentado en los ultimos 5 años"},{"$f":"CONCATENATE(H$225,K$225)","v":"34"},null,{"$f":"IF(K396=5,\"Catastrófico\",IF(K396=4,\"Mayor\",IF(K396=3,\"Moderado\",IF(K396=2,\"Menos\",IF(K396=1,\"Insignificante\",\"Digite Valor entre 1 y 5\")))))","v":"Digite Valor entre 1 y 5"},"",{"$f":"IF(M396=CE$9,\"E\",IF(M396=CF$9,\"A\",IF(M396=CG$9,\"M\",IF(M396=CH$9,\"B\",\"\"))))","v":""},{"$nulls":5},0,null,0,null,0,null,0,null,0,null,0,null,0,0,"",0,{"$nulls":13},0,"No aplica",0,"No aplica",null,"","","",null,""]
[null,{"$f":"B396+1","v":2},{"$nulls":17},0,null,0,null,0,null,0,null,0,null,0,null,0,0,{"$f":"IF(R397=\"\",\"\",IF(R397=\"Afecta la Probabilidad\",IF(AND(AG397>=0,AG397<=50),\"No disminuye la Probabilidad\",IF(AND(AG397>50,AG397<=75),\"Disminuye la Probabilidad en 1\",IF(AND(AG397>75,AG397<=100),\"Disminuye la Probabilidad en 2\",\"\"))),IF(AND(AG397>=0,AG397<=50),\"No disminuye el Impacto\",IF(AND(AG397>50,AG397<=75),\"Disminuye el Impacto en 1\",IF(AND(AG397>75,AG397<=100),\"Disminuye el Impacto en 2\",\"\")))))","v":""},0,{"$nulls":14},"No aplica",null,"No aplica"]
[null,3,{"$nulls":17},0,null,0,null,0,null,0,null,0,null,0,null,0,0,{"$f":"IF(R398=\"\",\"\",IF(R398=\"Afecta la Probabilidad\",IF(AND(AG398>=0,AG398<=50),\"No disminuye la Probabilidad\",IF(AND(AG398>50,AG398<=75),\"Disminuye la Probabilidad en 1\",IF(AND(AG398>75,AG398<=100),\"Disminuye la Probabilidad en 2\",\"\"))),IF(AND(AG398>=0,AG398<=50),\"No disminuye el Impacto\",IF(AND(AG398>50,AG398<=75),\"Disminuye el Impacto en 1\",IF(AND(AG398>75,AG398<=100),\"Disminuye el Impacto en 2\",\"\")))))","v":""},0,{"$nulls":14},"No aplica",null,"No aplica"]
[null,4,{"$nulls":17},0,null,0,null,0,null,0,null,0,null,0,null,0,0,{"$f":"IF(R399=\"\",\"\",IF(R399=\"Afecta la Probabilidad\",IF(AND(AG399>=0,AG399<=50),\"No disminuye la Probabilidad\",IF(AND(AG399>50,AG399<=75),\"Disminuye la Probabilidad en 1\",IF(AND(AG399>75,AG399<=100),\"Disminuye la Probabilidad en 2\",\"\"))),IF(AND(AG399>=0,AG399<=50),\"No disminuye el Impacto\",IF(AND(AG399>50,AG399<=75),\"Disminuye el Impacto en 1\",IF(AND(AG399>75,AG399<=100),\"Disminuye el Impacto en 2\",\"\")))))","v":""},0,{"$nulls":14},"No aplica",null,"No aplica"]
[null,5,{"$nulls":17},0,null,0,null,0,null,0,null,0,null,0,null,0,0,{"$f":"IF(R400=\"\",\"\",IF(R400=\"Afecta la Probabilidad\",IF(AND(AG400>=0,AG400<=50),\"No disminuye la Probabilidad\",IF(AND(AG400>50,AG400<=75),\"Disminuye la Probabilidad en 1\",IF(AND(AG400>75,AG400<=100),\"Disminuye la Probabilidad en 2\",\"\"))),IF(AND(AG400>=0,AG400<=50),\"No disminuye el Impacto\",IF(AND(AG400>50,AG400<=75),\"Disminuye el Impacto en 1\",IF(AND(AG400>75,AG400<=100),\"Disminuye el Impacto en 2\",\"\")))))","v":""},0,{"$nulls":14},"No aplica",null,"No aplica"]
[null,6,{"$nulls":17},0,null,0,null,0,null,0,null,0,null,0,null,0,0,"",0,{"$nulls":14},"No aplica",null,"No aplica"]
[null,7,{"$nulls":17},0,null,0,null,0,null,0,null,0,null,0,null,0,0,"",0,{"$nulls":14},"No aplica",null,"No aplica"]
[null,8,{"$nulls":17},0,null,0,null,0,null,0,null,0,null,0,null,0,0,"",0,{"$nulls":14},"No aplica",null,"No aplica"]
[null,9,{"$nulls":17},0,null,0,null,0,null,0,null,0,null,0,null,0,0,"",0,{"$nulls":14},"No aplica",null,"No aplica"]
["R45",1,{"$nulls":6},{"$f":"IF(H405=5,\"Mas de una vez al año\",IF(H405=4,\"Al menos una vez en el ultimo año\",IF(H405=3,\"Al menos una vez en los ultimos 2 años\",IF(H405=2,\"Al menos una vez en los ultimos 5 años\",\"No se ha presentado en los ultimos 5 años\"))))","v":"No se ha presentado en los ultimos 5 años"},{"$f":"CONCATENATE(H$405,K$405)","v":""},null,{"$f":"IF(K405=5,\"Catastrófico\",IF(K405=4,\"Mayor\",IF(K405=3,\"Moderado\",IF(K405=2,\"Menos\",IF(K405=1,\"Insignificante\",\"Digite Valor entre 1 y 5\")))))","v":"Digite Valor entre 1 y 5"},"",{"$f":"IF(M405=CE$9,\"E\",IF(M405=CF$9,\"A\",IF(M405=CG$9,\"M\",IF(M405=CH$9,\"B\",\"\"))))","v":""},{"$nulls":5},0,null,0,null,0,null,0,null,0,null,0,null,0,0,"",0,{"$nulls":13},0,"No aplica",0,"No aplica",null,"","","",null,""]
[null,{"$f":"B405+1","v":2},{"$nulls":17},0,null,0,null,0,null,0,null,0,null,0,null,0,0,{"$f":"IF(R406=\"\",\"\",IF(R406=\"Afecta la Probabilidad\",IF(AND(AG406>=0,AG406<=50),\"No disminuye la Probabilidad\",IF(AND(AG406>50,AG406<=75),\"Disminuye la Probabilidad en 1\",IF(AND(AG406>75,AG406<=100),\"Disminuye la Probabilidad en 2\",\"\"))),IF(AND(AG406>=0,AG406<=50),\"No disminuye el Impacto\",IF(AND(AG406>50,AG406<=75),\"Disminuye el Impacto en 1\",IF(AND(AG406>75,AG406<=100),\"Disminuye el Impacto en 2\",\"\")))))","v":""},0,{"$nulls":14},"No aplica",null,"No aplica"]
[null,3,{"$nulls":17},0,null,0,null,0,null,0,null,0,null,0,null,0,0,{"$f":"IF(R407=\"\",\"\",IF(R407=\"Afecta la Probabilidad\",IF(AND(AG407>=0,AG407<=50),\"No disminuye la Probabilidad\",IF(AND(AG407>50,AG407<=75),\"Disminuye la Probabilidad en 1\",IF(AND(AG407>75,AG407<=100),\"Disminuye la Probabilidad en 2\",\"\"))),IF(AND(AG407>=0,AG407<=50),\"No disminuye el Impacto\",IF(AND(AG407>50,AG407<=75),\"Disminuye el Impacto en 1\",IF(AND(AG407>75,AG407<=100),\"Disminuye el Impacto en 2\",\"\")))))","v":""},0,{"$nulls":14},"No aplica",null,"No aplica"]
[null,4,{"$nulls":17},0,null,0,null,0,null,0,null,0,null,0,null,0,0,{"$f":"IF(R408=\"\",\"\",IF(R408=\"Afecta la Probabilidad\",IF(AND(AG408>=0,AG408<=50),\"No disminuye la Probabilidad\",IF(AND(AG408>50,AG408<=75),\"Disminuye la Probabilidad en 1\",IF(AND(AG408>75,AG408<=100),\"Disminuye la Probabilidad en 2\",\"\"))),IF(AND(AG408>=0,AG408<=50),\"No disminuye el Impacto\",IF(AND(AG408>50,AG408<=75),\"Disminuye el Impacto en 1\",IF(AND(AG408>75,AG408<=100),\"Disminuye el Impacto en 2\",\"\")))))","v":""},0,{"$nulls":14},"No aplica",null,"No aplica"]
[null,5,{"$nulls":17},0,null,0,null,0,null,0,null,0,null,0,null,0,0,{"$f":"IF(R409=\"\",\"\",IF(R409=\"Afecta la Probabilidad\",IF(AND(AG409>=0,AG409<=50),\"No disminuye la Probabilidad\",IF(AND(AG409>50,AG409<=75),\"Disminuye la Probabilidad en 1\",IF(AND(AG409>75,AG409<=100),\"Disminuye la Probabilidad en 2\",\"\"))),IF(AND(AG409>=0,AG409<=50),\"No disminuye el Impacto\",IF(AND(AG409>50,AG409<=75),\"Disminuye el Impacto en 1\",IF(AND(AG409>75,AG409<=100),\"Disminuye el Impacto en 2\",\"\")))))","v":""},0,{"$nulls":14},"No aplica",null,"No aplica"]
[null,6,{"$nulls":17},0,null,0,null,0,null,0,null,0,null,0,null,0,0,"",0,{"$nulls":14},"No aplica",null,"No aplica"]
[null,7,{"$nulls":17},0,null,0,null,0,null,0,null,0,null,0,null,0,0,"",0,{"$nulls":14},"No aplica",null,"No aplica"]
[null,8,{"$nulls":17},0,null,0,null,0,null,0,null,0,null,0,null,0,0,"",0,{"$nulls":14},"No aplica",null,"No aplica"]
[null,9,{"$nulls":17},0,null,0,null,0,null,0,null,0,null,0,null,0,0,"",0,{"$nulls":14},"No aplica",null,"No aplica"]
["R46",1,{"$nulls":6},{"$f":"IF(H414=5,\"Mas de una vez al año\",IF(H414=4,\"Al menos una vez en el ultimo año\",IF(H414=3,\"Al menos una vez en los ultimos 2 años\",IF(H414=2,\"Al menos una vez en los ultimos 5 años\",\"No se ha presentado en los ultimos 5 años\"))))","v":"No se ha presentado en los ultimos 5 años"},{"$f":"CONCATENATE(H$414,K$414)","v":""},null,{"$f":"IF(K414=5,\"Catastrófico\",IF(K414=4,\"Mayor\",IF(K414=3,\"Moderado\",IF(K414=2,\"Menos\",IF(K414=1,\"Insignificante\",\"Digite Valor entre 1 y 5\")))))","v":"Digite Valor entre 1 y 5"},{"$f":"IF(L414=\"Digite Valor entre 1 y 5\",\"\",IF(COUNTIF(CE$10:CE$17,CONCATENATE(H414,K414)),CE$9,IF(COUNTIF(CF$10:CF$17,CONCATENATE(H414,K414)),CF$9,IF(COUNTIF(CG$10:CG$13,CONCATENATE(H414,K414)),CG$9,CH$9))))","v":""},{"$f":"IF(M414=CE$9,\"E\",IF(M414=CF$9,\"A\",IF(M414=CG$9,\"M\",IF(M414=CH$9,\"B\",\"\"))))","v":""},{"$nulls":5},0,null,0,null,0,null,0,null,0,null,0,null,0,0,"",0,{"$nulls":13},0,"No aplica",0,"No aplica",null,"","","",null,""]
[null,{"$f":"B414+1","v":2},{"$nulls":17},0,null,0,null,0,null,0,null,0,null,0,null,0,0,{"$f":"IF(R415=\"\",\"\",IF(R415=\"Afecta la Probabilidad\",IF(AND(AG415>=0,AG415<=50),\"No disminuye la Probabilidad\",IF(AND(AG415>50,AG415<=75),\"Disminuye la Probabilidad en 1\",IF(AND(AG415>75,AG415<=100),\"Disminuye la Probabilidad en 2\",\"\"))),IF(AND(AG415>=0,AG415<=50),\"No disminuye el Impacto\",IF(AND(AG415>50,AG415<=75),\"Disminuye el Impacto en 1\",IF(AND(AG415>75,AG415<=100),\"Disminuye el Impacto en 2\",\"\")))))","v":""},0,{"$nulls":14},"No aplica",null,"No aplica"]
[null,3,{"$nulls":17},0,null,0,null,0,null,0,null,0,null,0,null,0,0,{"$f":"IF(R416=\"\",\"\",IF(R416=\"Afecta la Probabilidad\",IF(AND(AG416>=0,AG416<=50),\"No disminuye la Probabilidad\",IF(AND(AG416>50,AG416<=75),\"Disminuye la Probabilidad en 1\",IF(AND(AG416>75,AG416<=100),\"Disminuye la Probabilidad en 2\",\"\"))),IF(AND(AG416>=0,AG416<=50),\"No disminuye el Impacto\",IF(AND(AG416>50,AG416<=75),\"Disminuye el Impacto en 1\",IF(AND(AG416>75,AG416<=100),\"Disminuye el Impacto en 2\",\"\")))))","v":""},0,{"$nulls":14},"No aplica",null,"No aplica"]
[null,4,{"$nulls":17},0,null,0,null,0,null,0,null,0,null,0,null,0,0,{"$f":"IF(R417=\"\",\"\",IF(R417=\"Afecta la Probabilidad\",IF(AND(AG417>=0,AG417<=50),\"No disminuye la Probabilidad\",IF(AND(AG417>50,AG417<=75),\"Disminuye la Probabilidad en 1\",IF(AND(AG417>75,AG417<=100),\"Disminuye la Probabilidad en 2\",\"\"))),IF(AND(AG417>=0,AG417<=50),\"No disminuye el Impacto\",IF(AND(AG417>50,AG417<=75),\"Disminuye el Impacto en 1\",IF(AND(AG417>75,AG417<=100),\"Disminuye el Impacto en 2\",\"\")))))","v":""},0,{"$nulls":14},{"$f":"IF(R417=\"Afecta la Probabilidad\",AW417-(AW417-AI417),\"No aplica\")","v":"No aplica"},null,{"$f":"IF(R417=\"Afecta el Impacto\",AY417-(AY417-AI417),\"No aplica\")","v":"No aplica"}]
[null,5,{"$nulls":17},0,null,0,null,0,null,0,null,0,null,0,null,0,0,{"$f":"IF(R418=\"\",\"\",IF(R418=\"Afecta la Probabilidad\",IF(AND(AG418>=0,AG418<=50),\"No disminuye la Probabilidad\",IF(AND(AG418>50,AG418<=75),\"Disminuye la Probabilidad en 1\",IF(AND(AG418>75,AG418<=100),\"Disminuye la Probabilidad en 2\",\"\"))),IF(AND(AG418>=0,AG418<=50),\"No disminuye el Impacto\",IF(AND(AG418>50,AG418<=75),\"Disminuye el Impacto en 1\",IF(AND(AG418>75,AG418<=100),\"Disminuye el Impacto en 2\",\"\")))))","v":""},0,{"$nulls":14},"No aplica",null,"No aplica"]
[null,6,{"$nulls":17},0,null,0,null,0,null,0,null,0,null,0,null,0,0,"",0,{"$nulls":14},"No aplica",null,"No aplica"]
[null,7,{"$nulls":17},0,null,0,null,0,null,0,null,0,null,0,null,0,0,"",0,{"$nulls":14},"No aplica",null,"No aplica"]
[null,8,{"$nulls":17},0,null,0,null,0,null,0,null,0,null,0,null,0,0,"",0,{"$nulls":14},"No aplica",null,"No aplica"]
[null,9,{"$nulls":17},0,null,0,null,0,null,0,null,0,null,0,null,0,0,"",0,{"$nulls":14},"No aplica",null,"No aplica"]
["R47",1,{"$nulls":6},{"$f":"IF(H423=5,\"Mas de una vez al año\",IF(H423=4,\"Al menos una vez en el ultimo año\",IF(H423=3,\"Al menos una vez en los ultimos 2 años\",IF(H423=2,\"Al menos una vez en los ultimos 5 años\",\"No se ha presentado en los ultimos 5 años\"))))","v":"No se ha presentado en los ultimos 5 años"},{"$f":"CONCATENATE(H$423,K$423)","v":""},null,{"$f":"IF(K423=5,\"Catastrófico\",IF(K423=4,\"Mayor\",IF(K423=3,\"Moderado\",IF(K423=2,\"Menos\",IF(K423=1,\"Insignificante\",\"Digite Valor entre 1 y 5\")))))","v":"Digite Valor entre 1 y 5"},{"$f":"IF(L423=\"Digite Valor entre 1 y 5\",\"\",IF(COUNTIF(CE$10:CE$17,CONCATENATE(H423,K423)),CE$9,IF(COUNTIF(CF$10:CF$17,CONCATENATE(H423,K423)),CF$9,IF(COUNTIF(CG$10:CG$13,CONCATENATE(H423,K423)),CG$9,CH$9))))","v":""},{"$f":"IF(M423=CE$9,\"E\",IF(M423=CF$9,\"A\",IF(M423=CG$9,\"M\",IF(M423=CH$9,\"B\",\"\"))))","v":""},{"$nulls":5},0,null,0,null,0,null,0,null,0,null,0,null,0,0,"",0,{"$nulls":13},0,"No aplica",0,"No aplica",null,"","","",null,""]
[null,{"$f":"B423+1","v":2},{"$nulls":17},0,null,0,null,0,null,0,null,0,null,0,null,0,0,{"$f":"IF(R424=\"\",\"\",IF(R424=\"Afecta la Probabilidad\",IF(AND(AG424>=0,AG424<=50),\"No disminuye la Probabilidad\",IF(AND(AG424>50,AG424<=75),\"Disminuye la Probabilidad en 1\",IF(AND(AG424>75,AG424<=100),\"Disminuye la Probabilidad en 2\",\"\"))),IF(AND(AG424>=0,AG424<=50),\"No disminuye el Impacto\",IF(AND(AG424>50,AG424<=75),\"Disminuye el Impacto en 1\",IF(AND(AG424>75,AG424<=100),\"Disminuye el Impacto en 2\",\"\")))))","v":""},0,{"$nulls":14},"No aplica",null,"No aplica"]
[null,3,{"$nulls":17},0,null,0,null,0,null,0,null,0,null,0,null,0,0,{"$f":"IF(R425=\"\",\"\",IF(R425=\"Afecta la Probabilidad\",IF(AND(AG425>=0,AG425<=50),\"No disminuye la Probabilidad\",IF(AND(AG425>50,AG425<=75),\"Disminuye la Probabilidad en 1\",IF(AND(AG425>75,AG425<=100),\"Disminuye la Probabilidad en 2\",\"\"))),IF(AND(AG425>=0,AG425<=50),\"No disminuye el Impacto\",IF(AND(AG425>50,AG425<=75),\"Disminuye el Impacto en 1\",IF(AND(AG425>75,AG425<=100),\"Disminuye el Impacto en 2\",\"\")))))","v":""},0,{"$nulls":14},"No aplica",null,"No aplica"]
[null,4,{"$nulls":17},0,null,0,null,0,null,0,null,0,null,0,null,0,0,{"$f":"IF(R426=\"\",\"\",IF(R426=\"Afecta la Probabilidad\",IF(AND(AG426>=0,AG426<=50),\"No disminuye la Probabilidad\",IF(AND(AG426>50,AG426<=75),\"Disminuye la Probabilidad en 1\",IF(AND(AG426>75,AG426<=100),\"Disminuye la Probabilidad en 2\",\"\"))),IF(AND(AG426>=0,AG426<=50),\"No disminuye el Impacto\",IF(AND(AG426>50,AG426<=75),\"Disminuye el Impacto en 1\",IF(AND(AG426>75,AG426<=100),\"Disminuye el Impacto en 2\",\"\")))))","v":""},0,{"$nulls":14},"No aplica",null,"No aplica"]
[null,5,{"$nulls":17},0,null,0,null,0,null,0,null,0,null,0,null,0,0,{"$f":"IF(R427=\"\",\"\",IF(R427=\"Afecta la Probabilidad\",IF(AND(AG427>=0,AG427<=50),\"No disminuye la Probabilidad\",IF(AND(AG427>50,AG427<=75),\"Disminuye la Probabilidad en 1\",IF(AND(AG427>75,AG427<=100),\"Disminuye la Probabilidad en 2\",\"\"))),IF(AND(AG427>=0,AG427<=50),\"No disminuye el Impacto\",IF(AND(AG427>50,AG427<=75),\"Disminuye el Impacto en 1\",IF(AND(AG427>75,AG427<=100),\"Disminuye el Impacto en 2\",\"\")))))","v":""},0,{"$nulls":14},"No aplica",null,"No aplica"]
[null,6,{"$nulls":17},0,null,0,null,0,null,0,null,0,null,0,null,0,0,"",0,{"$nulls":14},"No aplica",null,"No aplica"]
[null,7,{"$nulls":17},0,null,0,null,0,null,0,null,0,null,0,null,0,0,"",0,{"$nulls":14},"No aplica",null,"No aplica"]
[null,8,{"$nulls":17},0,null,0,null,0,null,0,null,0,null,0,null,0,0,"",0,{"$nulls":14},"No aplica",null,"No aplica"]
[null,9,{"$nulls":17},0,null,0,null,0,null,0,null,0,null,0,null,0,0,"",0,{"$nulls":14},"No aplica",null,"No aplica"]
["R48",1,{"$nulls":6},{"$f":"IF(H432=5,\"Mas de una vez al año\",IF(H432=4,\"Al menos una vez en el ultimo año\",IF(H432=3,\"Al menos una vez en los ultimos 2 años\",IF(H432=2,\"Al menos una vez en los ultimos 5 años\",\"No se ha presentado en los ultimos 5 años\"))))","v":"No se ha presentado en los ultimos 5 años"},{"$f":"CONCATENATE(H$432,K$432)","v":""},null,{"$f":"IF(K432=5,\"Catastrófico\",IF(K432=4,\"Mayor\",IF(K432=3,\"Moderado\",IF(K432=2,\"Menos\",IF(K432=1,\"Insignificante\",\"Digite Valor entre 1 y 5\")))))","v":"Digite Valor entre 1 y 5"},"",{"$f":"IF(M432=CE$9,\"E\",IF(M432=CF$9,\"A\",IF(M432=CG$9,\"M\",IF(M432=CH$9,\"B\",\"\"))))","v":""},{"$nulls":5},0,null,0,null,0,null,0,null,0,null,0,null,0,0,"",0,{"$nulls":13},0,"No aplica",0,"No aplica",null,"","","",null,""]
[null,{"$f":"B432+1","v":2},{"$nulls":17},0,null,0,null,0,null,0,null,0,null,0,null,0,0,{"$f":"IF(R433=\"\",\"\",IF(R433=\"Afecta la Probabilidad\",IF(AND(AG433>=0,AG433<=50),\"No disminuye la Probabilidad\",IF(AND(AG433>50,AG433<=75),\"Disminuye la Probabilidad en 1\",IF(AND(AG433>75,AG433<=100),\"Disminuye la Probabilidad en 2\",\"\"))),IF(AND(AG433>=0,AG433<=50),\"No disminuye el Impacto\",IF(AND(AG433>50,AG433<=75),\"Disminuye el Impacto en 1\",IF(AND(AG433>75,AG433<=100),\"Disminuye el Impacto en 2\",\"\")))))","v":""},0,{"$nulls":14},"No aplica",null,"No aplica"]
[null,3,{"$nulls":17},0,null,0,null,0,null,0,null,0,null,0,null,0,0,{"$f":"IF(R434=\"\",\"\",IF(R434=\"Afecta la Probabilidad\",IF(AND(AG434>=0,AG434<=50),\"No disminuye la Probabilidad\",IF(AND(AG434>50,AG434<=75),\"Disminuye la Probabilidad en 1\",IF(AND(AG434>75,AG434<=100),\"Disminuye la Probabilidad en 2\",\"\"))),IF(AND(AG434>=0,AG434<=50),\"No disminuye el Impacto\",IF(AND(AG434>50,AG434<=75),\"Disminuye el Impacto en 1\",IF(AND(AG434>75,AG434<=100),\"Disminuye el Impacto en 2\",\"\")))))","v":""},0,{"$nulls":14},"No aplica",null,"No aplica"]
[null,4,{"$nulls":17},{"$f":"IF(S435=\"Si\",15,0)","v":0},null,{"$f":"IF(U435=\"Si\",5,0)","v":0},null,{"$f":"IF(W435=\"Si\",15,0)","v":0},null,{"$f":"IF(Y435=\"Si\",10,0)","v":0},null,{"$f":"IF(AA435=\"Si\",15,0)","v":0},null,{"$f":"IF(AC435=\"Si\",10,0)","v":0},null,{"$f":"IF(AE435=\"Si\",30,0)","v":0},{"$f":"T435+V435+X435+Z435+AB435+AD435+AF435","v":0},{"$f":"IF(R435=\"\",\"\",IF(R435=\"Afecta la Probabilidad\",IF(AND(AG435>=0,AG435<=50),\"No disminuye la Probabilidad\",IF(AND(AG435>50,AG435<=75),\"Disminuye la Probabilidad en 1\",IF(AND(AG435>75,AG435<=100),\"Disminuye la Probabilidad en 2\",\"\"))),IF(AND(AG435>=0,AG435<=50),\"No disminuye el Impacto\",IF(AND(AG435>50,AG435<=75),\"Disminuye el Impacto en 1\",IF(AND(AG435>75,AG435<=100),\"Disminuye el Impacto en 2\",\"\")))))","v":""},{"$f":"IF(AG435<=50,0,IF(AND(AG435>50,AG435<=75),1,IF(AND(AG435>75,AG435<=100),2,\"\")))","v":0},{"$nulls":14},"No aplica",null,"No aplica"]
[null,5,{"$nulls":17},0,null,0,null,0,null,0,null,0,null,0,null,0,0,{"$f":"IF(R436=\"\",\"\",IF(R436=\"Afecta la Probabilidad\",IF(AND(AG436>=0,AG436<=50),\"No disminuye la Probabilidad\",IF(AND(AG436>50,AG436<=75),\"Disminuye la Probabilidad en 1\",IF(AND(AG436>75,AG436<=100),\"Disminuye la Probabilidad en 2\",\"\"))),IF(AND(AG436>=0,AG436<=50),\"No disminuye el Impacto\",IF(AND(AG436>50,AG436<=75),\"Disminuye el Impacto en 1\",IF(AND(AG436>75,AG436<=100),\"Disminuye el Impacto en 2\",\"\")))))","v":""},0,{"$nulls":14},"No aplica",null,"No aplica"]
[null,6,{"$nulls":17},0,null,0,null,0,null,0,null,0,null,0,null,0,0,"",0,{"$nulls":14},"No aplica",null,"No aplica"]
[null,7,{"$nulls":17},0,null,0,null,0,null,0,null,0,null,0,null,0,0,"",0,{"$nulls":14},"No aplica",null,"No aplica"]
[null,8,{"$nulls":17},0,null,0,null,0,null,0,null,0,null,0,null,0,0,"",0,{"$nulls":14},"No aplica",null,"No aplica"]
[null,9,{"$nulls":17},0,null,0,null,0,null,0,null,0,null,0,null,0,0,"",0,{"$nulls":14},"No aplica",null,"No aplica"]
[null,null,"ELABORADO POR:",{"$nulls":3},"Doctoras: Yaneth Noguera Ramos  Vicerrectora Administrativa, Dra Leyla Milena Llanten Escobar, Ing Luz Oliva Herrera, Dr Diego llera, Dra Miriam Torres Londoño , Ing. Fancisaco Teran Cuaran, Secretaria General Universidad"]
[null,null,"REVISADO POR:"]
[null,null,"APROBADO POR:"]
[]
[]
[]
[null,null,1,2,3,4,5,6,{"$f":"H447+1","v":7},{"$f":"I447+1","v":8},9,10,11,12,13,14,15,16,17,18,19,20,21,22,23,24,25,26,27,28,29,30,31,32,33,34,35,36,37,38,39,40,41,42,43,44,45,46,47,48,49,50]
[null,null,{"$f":"9*C447","v":9},{"$f":"9*D447","v":18},27,36,45,54,63,72,81,90,99,108,117,126,135,144,153,162,171,180,189,198,207,216,225,234,243,252,261,270,279,288,297,306,315,324,333,342,351,360,369,378,387,396,405,414,423,432,441,450]
[null,null,"R1","R2","R3","R4","R5","R6","R7","R8","R9","R10","R11","R12","R13","R14","R15","R16","R17","R18","R19","R20","R21","R22","R23","R24","R25","R26","R27","R28","R29","R30","R31","R32","R33","R34","R35","R36","R37","R38","R39","R40","R41","R42","R43","R44","R45","R46","R47","R48","R49","R50"]
[null,null,{"$f":"IF(INDIRECT(\"n\"&C448)=\"E\",1,0)","v":1},{"$f":"IF(INDIRECT(\"n\"&D448)=\"E\",1,0)","v":1},{"$f":"IF(INDIRECT(\"n\"&E448)=\"E\",1,0)","v":1},1,1,1,1,1,1,1,1,1,1,1,1,1,1,0,1,0,1,1,1,1,1,0,0,1,0,1,1,1,1,1,1,0,0,0,0,0]
[null,null,{"$f":"IF(INDIRECT(\"n\"&C448)=\"A\",1,0)","v":0},{"$f":"IF(INDIRECT(\"n\"&D448)=\"A\",1,0)","v":0},0,0,0,0,0,0,0,0,0,0,0,0,0,0,0,1,0,1,0,0,0,0,0,1,1,0,1,0,0,0,0,0,0,0,0,0,0,0]
[null,null,{"$f":"IF(INDIRECT(\"n\"&C448)=\"M\",1,0)","v":0},{"$f":"IF(INDIRECT(\"n\"&D448)=\"M\",1,0)","v":0},0,0,0,0,0,0,0,0,0,0,0,0,0,0,0,0,0,0,0,0,0,0,0,0,0,0,0,0,0,0,0,0,0,1,1,1,1,0]
[null,null,{"$f":"IF(INDIRECT(\"n\"&C448)=\"B\",1,0)","v":0},{"$f":"IF(INDIRECT(\"n\"&D448)=\"B\",1,0)","v":0},0,0,0,0,0,0,0,0,0,0,0,0,0,0,0,0,0,0,0,0,0,0,0,0,0,0,0,0,0,0,0,0,0,0,0,0,0,0]
[null,null,{"$f":"SUM(C450:C453)","v":1},{"$f":"SUM(D450:D453)","v":1},1,1,1,1,1,1,1,1,1,1,1,1,1,1,1,1,1,1,1,1,1,1,1,1,1,1,1,1,1,1,1,{"$nulls":8},{"$f":"SUM(AJ450:AJ453)","v":1},1,1,1,1,1,0,0,0,0]
[null,null,1,2,3,4,5,6,{"$f":"H455+1","v":7},8,9,10,11,12,13,14,15,16,17,18,19,20,21,22,23,24,25,26,27,28,29,30,31,32,33,34,35,36,37,38,39,40,41,42,43,44,45,46,47,48,49,50]
[null,null,{"$f":"9*C455","v":9},{"$f":"9*D455","v":18},27,36,45,54,63,72,81,90,99,108,117,126,135,144,153,162,171,180,189,198,207,216,225,234,243,252,261,270,279,288,297,306,315,324,333,342,351,360,369,378,387,396,405,414,423,432,441,450]
[null,null,"R1","R2","R3","R4","R5","R6","R7","R8","R9","R10","R11","R12","R13","R14","R15","R16","R17","R18","R19","R20","R21","R22","R23","R24","R25","R26","R27","R28","R29","R30","R31","R32","R33","R34","R35","R36","R37","R38","R39","R40","R41","R42","R43","R44","R45","R46","R47","R48","R49","R50","R52"]
[null,null,{"$f":"IF(INDIRECT(\"ap\"&C448)=\"E\",1,0)","v":0},{"$f":"IF(INDIRECT(\"ap\"&D448)=\"E\",1,0)","v":1},0,0,0,1,0,0,0,0,0,1,1,1,1,1,0,0,1,0,1,0,0,0,0,0,0,1,0,0,0,1,0,0,0,0,0,0,0,0]
[null,null,{"$f":"IF(INDIRECT(\"ap\"&C448)=\"A\",1,0)","v":1},{"$f":"IF(INDIRECT(\"ap\"&D448)=\"A\",1,0)","v":0},1,1,1,0,1,1,1,1,1,0,0,0,0,0,1,1,0,0,0,1,1,1,1,1,1,0,1,1,1,0,1,1,1,0,0,0,0,0]
[null,null,{"$f":"IF(INDIRECT(\"ap\"&C448)=\"M\",1,0)","v":0},{"$f":"IF(INDIRECT(\"ap\"&D448)=\"M\",1,0)","v":0},0,0,0,0,0,0,0,0,0,0,0,0,0,0,0,0,0,1,0,0,0,0,0,0,0,0,0,0,0,0,0,0,0,0,0,1,1,0]
[null,null,{"$f":"IF(INDIRECT(\"ap\"&C448)=\"B\",1,0)","v":0},{"$f":"IF(INDIRECT(\"ap\"&D448)=\"B\",1,0)","v":0},0,0,0,0,0,0,0,0,0,0,0,0,0,0,0,0,0,0,0,0,0,0,0,0,0,0,0,0,0,0,0,0,0,1,1,0,0,0]
[null,null,{"$f":"SUM(C458:C461)","v":1},1,1,1,1,1,1,1,1,1,1,1,1,1,1,1,1,1,1,1,1,1,1,1,1,1,1,1,1,1,1,1,1]
[]
[null,null,"RIESGO INHERENTE",null,null,"RIESGO RESIDUAL"]
[null,null,"NIVEL","CANTIDAD",null,"NIVEL","CANTIDAD"]
[null,null,"Zona de riesgo extrema",{"$f":"SUM(C450:BM450)","v":30},null,"Zona de riesgo extrema",{"$f":"SUM(C458:BM458)","v":11}]
[null,null,"Zona riesgo alta",{"$f":"SUM(C451:BM451)","v":5},null,"Zona riesgo alta",{"$f":"SUM(C459:BM459)","v":23}]
[null,null,"Zona de riesgo moderado",{"$f":"SUM(C452:BM452)","v":4},null,"Zona de riesgo moderado",{"$f":"SUM(C460:BM460)","v":3}]
[null,null,"Zona de riesgo baja",{"$f":"SUM(C453:BM453)","v":0},null,"Zona de riesgo baja",{"$f":"SUM(C461:BM461)","v":2}]
[null,null,"Total",{"$f":"SUM(D466:D469)","v":39},null,"Total",{"$f":"SUM(G466:G469)","v":39}]

{"sheet":"Mapa Riesgo Inherente ","index":3,"n_rows":65,"n_cols":42,"rows_kept":65,"merged":[[1,2,1,33],[2,4,2,9],[2,10,2,15],[2,16,2,20],[2,22,2,26],[2,28,2,33],[3,2,3,3],[3,4,3,9],[3,10,3,15],[3,16,3,21],[3,22,3,27],[3,28,3,33],[4,2,4,3],[5,1,44,1],[6,2,11,2],[6,3,11,3],[14,2,19,2],[14,3,19,3],[21,2,27,2],[21,3,27,3],[29,2,35,2],[29,3,35,3],[37,2,43,2],[37,3,43,3],[47,35,52,38],[55,36,55,38],[58,36,58,38],[61,36,61,38],[64,36,64,38]]}
[]
[null,null,"IMPACTO"]
[{"$nulls":4},1,{"$nulls":5},2,{"$nulls":5},3,{"$nulls":5},4,{"$nulls":5},5]
[{"$nulls":4},"INSIGNIFICANTE",{"$nulls":5},"MENOR",{"$nulls":5},"MODERADO",{"$nulls":5},"MAYOR",{"$nulls":5},"CATASTRÓFICO"]
[]
[null,"PROBABILIDAD",null,null,{"$f":"IF(CONCATENATE(C$7,E$3)=Matriz!$J$9,CONCATENATE(Matriz!A9,\" - P1 I1\"),\"\")","v":""},{"$f":"IF(CONCATENATE(C$7,E$3)=Matriz!$J$81,CONCATENATE(Matriz!A81,\" - P1 I1\"),\"\")","v":""},{"$f":"IF(CONCATENATE(C$7,E$3)=Matriz!$J$153,CONCATENATE(Matriz!A153,\" - P1 I1\"),\"\")","v":""},{"$f":"IF(CONCATENATE(C$7,E$3)=Matriz!$J$225,CONCATENATE(Matriz!A225,\" - P1 I1\"),\"\")","v":""},{"$f":"IF(CONCATENATE(C$7,E$3)=Matriz!$J$297,CONCATENATE(Matriz!A297,\" - P1 I1\"),\"\")","v":""},{"$f":"IF(CONCATENATE(C$7,E$3)=Matriz!$J$369,CONCATENATE(Matriz!A369,\" - P1 I1\"),\"\")","v":""},{"$f":"IF(CONCATENATE(C$7,K$3)=Matriz!$J$9,CONCATENATE(Matriz!A9,\" - P1 I2\"),\"\")","v":""},{"$f":"IF(CONCATENATE(C$7,K$3)=Matriz!$J$81,CONCATENATE(Matriz!A78,\" - P1 I2\"),\"\")","v":""},{"$f":"IF(CONCATENATE(C$7,K$3)=Matriz!$J$153,CONCATENATE(Matriz!A153,\" - P1 I2\"),\"\")","v":""},{"$f":"IF(CONCATENATE(C$7,K$3)=Matriz!$J$225,CONCATENATE(Matriz!A225,\" - P1 I2\"),\"\")","v":""},{"$f":"IF(CONCATENATE(C$7,K$3)=Matriz!$J$297,CONCATENATE(Matriz!A297,\" - P1 I2\"),\"\")","v":""},{"$f":"IF(CONCATENATE(C$7,K$3)=Matriz!$J$369,CONCATENATE(Matriz!A369,\" - P1 I2\"),\"\")","v":""},{"$f":"IF(CONCATENATE(C$7,Q$3)=Matriz!$J$9,CONCATENATE(Matriz!A9,\" - P1 I3\"),\"\")","v":""},{"$f":"IF(CONCATENATE(C$7,Q$3)=Matriz!$J$81,CONCATENATE(Matriz!A81,\" - P1 I3\"),\"\")","v":""},{"$f":"IF(CONCATENATE(C$7,Q$3)=Matriz!$J$153,CONCATENATE(Matriz!A153,\" - P1 I3\"),\"\")","v":""},{"$f":"IF(CONCATENATE(C$7,Q$3)=Matriz!$J$225,CONCATENATE(Matriz!A225,\" - P1 I3\"),\"\")","v":""},{"$f":"IF(CONCATENATE(C$7,Q$3)=Matriz!$J$297,CONCATENATE(Matriz!A297,\" - P1 I3\"),\"\")","v":""},{"$f":"IF(CONCATENATE(C$7,Q$3)=Matriz!$J$369,CONCATENATE(Matriz!A369,\" - P1 I3\"),\"\")","v":""},{"$f":"IF(CONCATENATE(C$7,W$3)=Matriz!$J$9,CONCATENATE(Matriz!A9,\" - P1 I4\"),\"\")","v":""},{"$f":"IF(CONCATENATE(C$7,W$3)=Matriz!$J$81,CONCATENATE(Matriz!A81,\" - P1 I4\"),\"\")","v":""},{"$f":"IF(CONCATENATE(C$7,W$3)=Matriz!$J$153,CONCATENATE(Matriz!A153,\" - P1 I4\"),\"\")","v":""},{"$f":"IF(CONCATENATE(C$7,W$3)=Matriz!$J$225,CONCATENATE(Matriz!A225,\" - P1 I4\"),\"\")","v":""},{"$f":"IF(CONCATENATE(C$7,W$3)=Matriz!$J$297,CONCATENATE(Matriz!A297,\" - P1 I4\"),\"\")","v":""},{"$f":"IF(CONCATENATE(C$7,W$3)=Matriz!$J$369,CONCATENATE(Matriz!A369,\" - P1 I4\"),\"\")","v":""},{"$f":"IF(CONCATENATE(C$7,AC$3)=Matriz!$J$9,CONCATENATE(Matriz!A9,\" - P1 I5\"),\"\")","v":""},{"$f":"IF(CONCATENATE(C$7,AC$3)=Matriz!$J$81,CONCATENATE(Matriz!A81,\" - P1 I5\"),\"\")","v":""},{"$f":"IF(CONCATENATE(C$7,AC$3)=Matriz!$J$153,CONCATENATE(Matriz!A153,\" - P1 I5\"),\"\")","v":""},{"$f":"IF(CONCATENATE(C$7,AC$3)=Matriz!$J$225,CONCATENATE(Matriz!A225,\" - P1 I5\"),\"\")","v":""},{"$f":"IF(CONCATENATE(C$7,AC$3)=Matriz!$J$297,CONCATENATE(Matriz!A297,\" - P1 I5\"),\"\")","v":""},{"$f":"IF(CONCATENATE(C$7,AC$3)=Matriz!$J$369,CONCATENATE(Matriz!A369,\" - P1 I5\"),\"\")","v":""},{"$nulls":5},9,1,{"$f":"AO6*AN6","v":9}]
[null,null,1,"RARO",{"$f":"IF(CONCATENATE(C$7,E$3)=Matriz!$J$18,CONCATENATE(Matriz!A18,\" - P1 I1\"),\"\")","v":""},{"$f":"IF(CONCATENATE(C$7,E$3)=Matriz!$J$90,CONCATENATE(Matriz!A90,\" - P1 I1\"),\"\")","v":""},{"$f":"IF(CONCATENATE(C$7,E$3)=Matriz!$J$162,CONCATENATE(Matriz!A162,\" - P1 I1\"),\"\")","v":""},{"$f":"IF(CONCATENATE(C$7,E$3)=Matriz!$J$234,CONCATENATE(Matriz!A234,\" - P1 I1\"),\"\")","v":""},{"$f":"IF(CONCATENATE(C$7,E$3)=Matriz!$J$306,CONCATENATE(Matriz!A306,\" - P1 I1\"),\"\")","v":""},{"$f":"IF(CONCATENATE(C$7,E$3)=Matriz!$J$378,CONCATENATE(Matriz!A378,\" - P1 I1\"),\"\")","v":""},{"$f":"IF(CONCATENATE(C$7,K$3)=Matriz!$J$18,CONCATENATE(Matriz!A18,\" - P1 I2\"),\"\")","v":""},{"$f":"IF(CONCATENATE(C$7,K$3)=Matriz!$J$90,CONCATENATE(Matriz!A90,\" - P1 I2\"),\"\")","v":""},{"$f":"IF(CONCATENATE(C$7,K$3)=Matriz!$J$162,CONCATENATE(Matriz!A162,\" - P1 I2\"),\"\")","v":""},{"$f":"IF(CONCATENATE(C$7,K$3)=Matriz!$J$234,CONCATENATE(Matriz!A234,\" - P1 I2\"),\"\")","v":""},{"$f":"IF(CONCATENATE(C$7,K$3)=Matriz!$J$306,CONCATENATE(Matriz!A306,\" - P1 I2\"),\"\")","v":""},{"$f":"IF(CONCATENATE(C$7,K$3)=Matriz!$J$378,CONCATENATE(Matriz!A378,\" - P1 I2\"),\"\")","v":""},{"$f":"IF(CONCATENATE(C$7,Q$3)=Matriz!$J$18,CONCATENATE(Matriz!A18,\" - P1 I3\"),\"\")","v":""},{"$f":"IF(CONCATENATE(C$7,Q$3)=Matriz!$J$90,CONCATENATE(Matriz!A90,\" - P1 I3\"),\"\")","v":""},{"$f":"IF(CONCATENATE(C$7,Q$3)=Matriz!$J$162,CONCATENATE(Matriz!A162,\" - P1 I3\"),\"\")","v":""},{"$f":"IF(CONCATENATE(C$7,Q$3)=Matriz!$J$234,CONCATENATE(Matriz!A234,\" - P1 I3\"),\"\")","v":""},{"$f":"IF(CONCATENATE(C$7,Q$3)=Matriz!$J$306,CONCATENATE(Matriz!A306,\" - P1 I3\"),\"\")","v":""},{"$f":"IF(CONCATENATE(C$7,Q$3)=Matriz!$J$378,CONCATENATE(Matriz!A378,\" - P1 I3\"),\"\")","v":""},{"$f":"IF(CONCATENATE(C$7,W$3)=Matriz!$J$18,CONCATENATE(Matriz!A18,\" - P1 I4\"),\"\")","v":""},{"$f":"IF(CONCATENATE(C$7,W$3)=Matriz!$J$90,CONCATENATE(Matriz!A90,\" - P1 I4\"),\"\")","v":""},{"$f":"IF(CONCATENATE(C$7,W$3)=Matriz!$J$162,CONCATENATE(Matriz!A162,\" - P1 I4\"),\"\")","v":""},{"$f":"IF(CONCATENATE(C$7,W$3)=Matriz!$J$234,CONCATENATE(Matriz!A234,\" - P1 I4\"),\"\")","v":"R26 - P1 I4"},{"$f":"IF(CONCATENATE(C$7,W$3)=Matriz!$J$306,CONCATENATE(Matriz!A306,\" - P1 I4\"),\"\")","v":""},{"$f":"IF(CONCATENATE(C$7,W$3)=Matriz!$J$378,CONCATENATE(Matriz!A378,\" - P1 I4\"),\"\")","v":""},{"$f":"IF(CONCATENATE(C$7,AC$3)=Matriz!$J$18,CONCATENATE(Matriz!A18,\" - P1 I5\"),\"\")","v":""},{"$f":"IF(CONCATENATE(C$7,AC$3)=Matriz!$J$90,CONCATENATE(Matriz!A90,\" - P1 I5\"),\"\")","v":""},{"$f":"IF(CONCATENATE(C$7,AC$3)=Matriz!$J$162,CONCATENATE(Matriz!A162,\" - P1 I5\"),\"\")","v":""},{"$f":"IF(CONCATENATE(C$7,AC$3)=Matriz!$J$234,CONCATENATE(Matriz!A234,\" - P1 I5\"),\"\")","v":""},{"$f":"IF(CONCATENATE(C$7,AC$3)=Matriz!$J$306,CONCATENATE(Matriz!A306,\" - P1 I5\"),\"\")","v":""},{"$f":"IF(CONCATENATE(C$7,AC$3)=Matriz!$J$378,CONCATENATE(Matriz!A378,\" - P1 I5\"),\"\")","v":""},{"$nulls":5},9,2,{"$f":"AO7*AN7","v":18}]
[{"$nulls":4},{"$f":"IF(CONCATENATE(C$7,E$3)=Matriz!$J$27,CONCATENATE(Matriz!A27,\" - P1 I1\"),\"\")","v":""},{"$f":"IF(CONCATENATE(C$7,E$3)=Matriz!$J$99,CONCATENATE(Matriz!A99,\" - P1 I1\"),\"\")","v":""},{"$f":"IF(CONCATENATE(C$7,E$3)=Matriz!$J$171,CONCATENATE(Matriz!A171,\" - P1 I1\"),\"\")","v":""},{"$f":"IF(CONCATENATE(C$7,E$3)=Matriz!$J$243,CONCATENATE(Matriz!A243,\" - P1 I1\"),\"\")","v":""},{"$f":"IF(CONCATENATE(C$7,E$3)=Matriz!$J$315,CONCATENATE(Matriz!A315,\" - P1 I1\"),\"\")","v":""},{"$f":"IF(CONCATENATE(C$7,E$3)=Matriz!$J$387,CONCATENATE(Matriz!A387,\" - P1 I1\"),\"\")","v":""},{"$f":"IF(CONCATENATE(C$7,K$3)=Matriz!$J$27,CONCATENATE(Matriz!A27,\" - P1 I2\"),\"\")","v":""},{"$f":"IF(CONCATENATE(C$7,K$3)=Matriz!$J$99,CONCATENATE(Matriz!A99,\" - P1 I2\"),\"\")","v":""},{"$f":"IF(CONCATENATE(C$7,K$3)=Matriz!$J$171,CONCATENATE(Matriz!A171,\" - P1 I2\"),\"\")","v":""},{"$f":"IF(CONCATENATE(C$7,K$3)=Matriz!$J$243,CONCATENATE(Matriz!A243,\" - P1 I2\"),\"\")","v":""},{"$f":"IF(CONCATENATE(C$7,K$3)=Matriz!$J$315,CONCATENATE(Matriz!A315,\" - P1 I2\"),\"\")","v":""},{"$f":"IF(CONCATENATE(C$7,K$3)=Matriz!$J$387,CONCATENATE(Matriz!A387,\" - P1 I2\"),\"\")","v":""},{"$f":"IF(CONCATENATE(C$7,Q$3)=Matriz!$J$27,CONCATENATE(Matriz!A27,\" - P1 I3\"),\"\")","v":""},{"$f":"IF(CONCATENATE(C$7,Q$3)=Matriz!$J$99,CONCATENATE(Matriz!A99,\" - P1 I3\"),\"\")","v":""},{"$f":"IF(CONCATENATE(C$7,Q$3)=Matriz!$J$171,CONCATENATE(Matriz!A171,\" - P1 I3\"),\"\")","v":""},{"$f":"IF(CONCATENATE(C$7,Q$3)=Matriz!$J$243,CONCATENATE(Matriz!A243,\" - P1 I3\"),\"\")","v":""},{"$f":"IF(CONCATENATE(C$7,Q$3)=Matriz!$J$315,CONCATENATE(Matriz!A315,\" - P1 I3\"),\"\")","v":""},{"$f":"IF(CONCATENATE(C$7,Q$3)=Matriz!$J$387,CONCATENATE(Matriz!A387,\" - P1 I3\"),\"\")","v":""},{"$f":"IF(CONCATENATE(C$7,W$3)=Matriz!$J$27,CONCATENATE(Matriz!A27,\" - P1 I4\"),\"\")","v":""},{"$f":"IF(CONCATENATE(C$7,W$3)=Matriz!$J$99,CONCATENATE(Matriz!A99,\" - P1 I4\"),\"\")","v":""},{"$f":"IF(CONCATENATE(C$7,W$3)=Matriz!$J$171,CONCATENATE(Matriz!A171,\" - P1 I4\"),\"\")","v":""},{"$f":"IF(CONCATENATE(C$7,W$3)=Matriz!$J$243,CONCATENATE(Matriz!A243,\" - P1 I4\"),\"\")","v":"R27 - P1 I4"},{"$f":"IF(CONCATENATE(C$7,W$3)=Matriz!$J$315,CONCATENATE(Matriz!A315,\" - P1 I4\"),\"\")","v":""},{"$f":"IF(CONCATENATE(C$7,W$3)=Matriz!$J$387,CONCATENATE(Matriz!A387,\" - P1 I4\"),\"\")","v":""},{"$f":"IF(CONCATENATE(C$7,AC$3)=Matriz!$J$27,CONCATENATE(Matriz!A27,\" - P1 I5\"),\"\")","v":""},{"$f":"IF(CONCATENATE(C$7,AC$3)=Matriz!$J$99,CONCATENATE(Matriz!A99,\" - P1 I5\"),\"\")","v":""},{"$f":"IF(CONCATENATE(C$7,AC$3)=Matriz!$J$171,CONCATENATE(Matriz!A171,\" - P1 I5\"),\"\")","v":""},{"$f":"IF(CONCATENATE(C$7,AC$3)=Matriz!$J$243,CONCATENATE(Matriz!A243,\" - P1 I5\"),\"\")","v":""},{"$f":"IF(CONCATENATE(C$7,AC$3)=Matriz!$J$315,CONCATENATE(Matriz!A315,\" - P1 I5\"),\"\")","v":""},{"$f":"IF(CONCATENATE(C$7,AC$3)=Matriz!$J$387,CONCATENATE(Matriz!A387,\" - P1 I5\"),\"\")","v":""},{"$nulls":5},9,3,27]
[{"$nulls":4},{"$f":"IF(CONCATENATE(C$7,E$3)=Matriz!$J$36,CONCATENATE(Matriz!A36,\" - P1 I1\"),\"\")","v":""},{"$f":"IF(CONCATENATE(C$7,E$3)=Matriz!$J$108,CONCATENATE(Matriz!A108,\" - P1 I1\"),\"\")","v":""},{"$f":"IF(CONCATENATE(C$7,E$3)=Matriz!$J$180,CONCATENATE(Matriz!A180,\" - P1 I1\"),\"\")","v":""},{"$f":"IF(CONCATENATE(C$7,E$3)=Matriz!$J$252,CONCATENATE(Matriz!A252,\" - P1 I1\"),\"\")","v":""},{"$f":"IF(CONCATENATE(C$7,E$3)=Matriz!$J$324,CONCATENATE(Matriz!A324,\" - P1 I1\"),\"\")","v":""},{"$f":"IF(CONCATENATE(C$7,E$3)=Matriz!$J$396,CONCATENATE(Matriz!A396,\" - P1 I1\"),\"\")","v":""},{"$f":"IF(CONCATENATE(C$7,K$3)=Matriz!$J$36,CONCATENATE(Matriz!A36,\" - P1 I2\"),\"\")","v":""},{"$f":"IF(CONCATENATE(C$7,K$3)=Matriz!$J$108,CONCATENATE(Matriz!A108,\" - P1 I2\"),\"\")","v":""},{"$f":"IF(CONCATENATE(C$7,K$3)=Matriz!$J$180,CONCATENATE(Matriz!A180,\" - P1 I2\"),\"\")","v":""},{"$f":"IF(CONCATENATE(C$7,K$3)=Matriz!$J$252,CONCATENATE(Matriz!A252,\" - P1 I2\"),\"\")","v":""},{"$f":"IF(CONCATENATE(C$7,K$3)=Matriz!$J$324,CONCATENATE(Matriz!A324,\" - P1 I2\"),\"\")","v":""},{"$f":"IF(CONCATENATE(C$7,K$3)=Matriz!$J$396,CONCATENATE(Matriz!A396,\" - P1 I2\"),\"\")","v":""},{"$f":"IF(CONCATENATE(C$7,Q$3)=Matriz!$J$36,CONCATENATE(Matriz!A36,\" - P1 I3\"),\"\")","v":""},{"$f":"IF(CONCATENATE(C$7,Q$3)=Matriz!$J$108,CONCATENATE(Matriz!A108,\" - P1 I3\"),\"\")","v":""},{"$f":"IF(CONCATENATE(C$7,Q$3)=Matriz!$J$180,CONCATENATE(Matriz!A180,\" - P1 I3\"),\"\")","v":""},{"$f":"IF(CONCATENATE(C$7,Q$3)=Matriz!$J$252,CONCATENATE(Matriz!A252,\" - P1 I3\"),\"\")","v":""},{"$f":"IF(CONCATENATE(C$7,Q$3)=Matriz!$J$324,CONCATENATE(Matriz!A324,\" - P1 I3\"),\"\")","v":""},{"$f":"IF(CONCATENATE(C$7,Q$3)=Matriz!$J$396,CONCATENATE(Matriz!A396,\" - P1 I3\"),\"\")","v":""},{"$f":"IF(CONCATENATE(C$7,W$3)=Matriz!$J$36,CONCATENATE(Matriz!A36,\" - P1 I4\"),\"\")","v":""},{"$f":"IF(CONCATENATE(C$7,W$3)=Matriz!$J$108,CONCATENATE(Matriz!A108,\" - P1 I4\"),\"\")","v":""},{"$f":"IF(CONCATENATE(C$7,W$3)=Matriz!$J$180,CONCATENATE(Matriz!A180,\" - P1 I4\"),\"\")","v":""},{"$f":"IF(CONCATENATE(C$7,W$3)=Matriz!$J$252,CONCATENATE(Matriz!A252,\" - P1 I4\"),\"\")","v":""},{"$f":"IF(CONCATENATE(C$7,W$3)=Matriz!$J$324,CONCATENATE(Matriz!A324,\" - P1 I4\"),\"\")","v":""},{"$f":"IF(CONCATENATE(C$7,W$3)=Matriz!$J$396,CONCATENATE(Matriz!A396,\" - P1 I4\"),\"\")","v":""},{"$f":"IF(CONCATENATE(C$7,AC$3)=Matriz!$J$36,CONCATENATE(Matriz!A36,\" - P1 I5\"),\"\")","v":""},{"$f":"IF(CONCATENATE(C$7,AC$3)=Matriz!$J$108,CONCATENATE(Matriz!A108,\" - P1 I5\"),\"\")","v":""},{"$f":"IF(CONCATENATE(C$7,AC$3)=Matriz!$J$180,CONCATENATE(Matriz!A180,\" - P1 I5\"),\"\")","v":"R20 - P1 I5"},{"$f":"IF(CONCATENATE(C$7,AC$3)=Matriz!$J$252,CONCATENATE(Matriz!A252,\" - P1 I5\"),\"\")","v":""},{"$f":"IF(CONCATENATE(C$7,AC$3)=Matriz!$J$324,CONCATENATE(Matriz!A324,\" - P1 I5\"),\"\")","v":""},{"$f":"IF(CONCATENATE(C$7,AC$3)=Matriz!$J$396,CONCATENATE(Matriz!A396,\" - P1 I5\"),\"\")","v":""},{"$nulls":5},9,4,36]
[{"$nulls":4},{"$f":"IF(CONCATENATE(B$7,D$3)=Matriz!$J$45,CONCATENATE(Matriz!A45,\" - P1 I1\"),\"\")","v":""},{"$f":"IF(CONCATENATE(C$7,E$3)=Matriz!$J$117,CONCATENATE(Matriz!A117,\" - P1 I1\"),\"\")","v":""},{"$f":"IF(CONCATENATE(C$7,E$3)=Matriz!$J$189,CONCATENATE(Matriz!A189,\" - P1 I1\"),\"\")","v":""},{"$f":"IF(CONCATENATE(C$7,E$3)=Matriz!$J$261,CONCATENATE(Matriz!A261,\" - P1 I1\"),\"\")","v":""},{"$f":"IF(CONCATENATE(C$7,E$3)=Matriz!$J$333,CONCATENATE(Matriz!A333,\" - P1 I1\"),\"\")","v":""},{"$f":"IF(CONCATENATE(C$7,E$3)=Matriz!$J$405,CONCATENATE(Matriz!A405,\" - P1 I1\"),\"\")","v":""},{"$f":"IF(CONCATENATE(C$7,K$3)=Matriz!$J$45,CONCATENATE(Matriz!A45,\" - P1 I2\"),\"\")","v":""},{"$f":"IF(CONCATENATE(C$7,K$3)=Matriz!$J$117,CONCATENATE(Matriz!A117,\" - P1 I2\"),\"\")","v":""},{"$f":"IF(CONCATENATE(C$7,K$3)=Matriz!$J$189,CONCATENATE(Matriz!A189,\" - P1 I2\"),\"\")","v":""},{"$f":"IF(CONCATENATE(C$7,K$3)=Matriz!$J$261,CONCATENATE(Matriz!A261,\" - P1 I2\"),\"\")","v":""},{"$f":"IF(CONCATENATE(C$7,K$3)=Matriz!$J$333,CONCATENATE(Matriz!A333,\" - P1 I2\"),\"\")","v":""},{"$f":"IF(CONCATENATE(C$7,K$3)=Matriz!$J$405,CONCATENATE(Matriz!A405,\" - P1 I2\"),\"\")","v":""},{"$f":"IF(CONCATENATE(C$7,Q$3)=Matriz!$J$45,CONCATENATE(Matriz!A45,\" - P1 I3\"),\"\")","v":""},{"$f":"IF(CONCATENATE(C$7,Q$3)=Matriz!$J$117,CONCATENATE(Matriz!A117,\" - P1 I3\"),\"\")","v":""},{"$f":"IF(CONCATENATE(C$7,Q$3)=Matriz!$J$189,CONCATENATE(Matriz!A189,\" - P1 I3\"),\"\")","v":""},{"$f":"IF(CONCATENATE(C$7,Q$3)=Matriz!$J$261,CONCATENATE(Matriz!A261,\" - P1 I3\"),\"\")","v":""},{"$f":"IF(CONCATENATE(C$7,Q$3)=Matriz!$J$333,CONCATENATE(Matriz!A333,\" - P1 I3\"),\"\")","v":""},{"$f":"IF(CONCATENATE(C$7,Q$3)=Matriz!$J$405,CONCATENATE(Matriz!A405,\" - P1 I3\"),\"\")","v":""},{"$f":"IF(CONCATENATE(C$7,W$3)=Matriz!$J$45,CONCATENATE(Matriz!A45,\" - P1 I4\"),\"\")","v":""},{"$f":"IF(CONCATENATE(C$7,W$3)=Matriz!$J$117,CONCATENATE(Matriz!A117,\" - P1 I4\"),\"\")","v":""},{"$f":"IF(CONCATENATE(C$7,W$3)=Matriz!$J$189,CONCATENATE(Matriz!A189,\" - P1 I4\"),\"\")","v":""},{"$f":"IF(CONCATENATE(C$7,W$3)=Matriz!$J$261,CONCATENATE(Matriz!A261,\" - P1 I4\"),\"\")","v":"R29 - P1 I4"},{"$f":"IF(CONCATENATE(C$7,W$3)=Matriz!$J$333,CONCATENATE(Matriz!A333,\" - P1 I4\"),\"\")","v":""},{"$f":"IF(CONCATENATE(C$7,W$3)=Matriz!$J$405,CONCATENATE(Matriz!A405,\" - P1 I4\"),\"\")","v":""},{"$f":"IF(CONCATENATE(C$7,AC$3)=Matriz!$J$45,CONCATENATE(Matriz!A45,\" - P1 I5\"),\"\")","v":""},{"$f":"IF(CONCATENATE(C$7,AC$3)=Matriz!$J$117,CONCATENATE(Matriz!A117,\" - P1 I5\"),\"\")","v":""},{"$f":"IF(CONCATENATE(C$7,AC$3)=Matriz!$J$189,CONCATENATE(Matriz!A189,\" - P1 I5\"),\"\")","v":""},{"$f":"IF(CONCATENATE(C$7,AC$3)=Matriz!$J$261,CONCATENATE(Matriz!A261,\" - P1 I5\"),\"\")","v":""},{"$f":"IF(CONCATENATE(C$7,AC$3)=Matriz!$J$333,CONCATENATE(Matriz!A333,\" - P1 I5\"),\"\")","v":""},{"$f":"IF(CONCATENATE(C$7,AC$3)=Matriz!$J$405,CONCATENATE(Matriz!A405,\" - P1 I5\"),\"\")","v":""},{"$nulls":5},9,5,45]
[{"$nulls":4},{"$f":"IF(CONCATENATE(C$7,E$3)=Matriz!$J$54,CONCATENATE(Matriz!A54,\" - P1 I1\"),\"\")","v":""},{"$f":"IF(CONCATENATE(C$7,E$3)=Matriz!$J$126,CONCATENATE(Matriz!A126,\" - P1 I1\"),\"\")","v":""},{"$f":"IF(CONCATENATE(C$7,E$3)=Matriz!$J$198,CONCATENATE(Matriz!A198,\" - P1 I1\"),\"\")","v":""},{"$f":"IF(CONCATENATE(C$7,E$3)=Matriz!$J$270,CONCATENATE(Matriz!A270,\" - P1 I1\"),\"\")","v":""},{"$f":"IF(CONCATENATE(C$7,E$3)=Matriz!$J$342,CONCATENATE(Matriz!A342,\" - P1 I1\"),\"\")","v":""},{"$f":"IF(CONCATENATE(C$7,E$3)=Matriz!$J$414,CONCATENATE(Matriz!A414,\" - P1 I1\"),\"\")","v":""},{"$f":"IF(CONCATENATE(B$7,J$3)=Matriz!$J$54,CONCATENATE(Matriz!A54,\" - P1 I2\"),\"\")","v":""},{"$f":"IF(CONCATENATE(C$7,K$3)=Matriz!$J$126,CONCATENATE(Matriz!A126,\" - P1 I2\"),\"\")","v":""},{"$f":"IF(CONCATENATE(C$7,K$3)=Matriz!$J$198,CONCATENATE(Matriz!A198,\" - P1 I2\"),\"\")","v":""},{"$f":"IF(CONCATENATE(C$7,K$3)=Matriz!$J$270,CONCATENATE(Matriz!A270,\" - P1 I2\"),\"\")","v":""},{"$f":"IF(CONCATENATE(C$7,K$3)=Matriz!$J$342,CONCATENATE(Matriz!A342,\" - P1 I2\"),\"\")","v":""},{"$f":"IF(CONCATENATE(C$7,K$3)=Matriz!$J$414,CONCATENATE(Matriz!A414,\" - P1 I2\"),\"\")","v":""},{"$f":"IF(CONCATENATE(C$7,Q$3)=Matriz!$J$54,CONCATENATE(Matriz!A54,\" - P1 I3\"),\"\")","v":""},{"$f":"IF(CONCATENATE(C$7,Q$3)=Matriz!$J$126,CONCATENATE(Matriz!A126,\" - P1 I3\"),\"\")","v":""},{"$f":"IF(CONCATENATE(C$7,Q$3)=Matriz!$J$198,CONCATENATE(Matriz!A198,\" - P1 I3\"),\"\")","v":""},{"$f":"IF(CONCATENATE(C$7,Q$3)=Matriz!$J$270,CONCATENATE(Matriz!A270,\" - P1 I3\"),\"\")","v":""},{"$f":"IF(CONCATENATE(C$7,Q$3)=Matriz!$J$342,CONCATENATE(Matriz!A342,\" - P1 I3\"),\"\")","v":"R38 - P1 I3"},{"$f":"IF(CONCATENATE(C$7,Q$3)=Matriz!$J$414,CONCATENATE(Matriz!A414,\" - P1 I3\"),\"\")","v":""},{"$f":"IF(CONCATENATE(C$7,W$3)=Matriz!$J$54,CONCATENATE(Matriz!A54,\" - P1 I4\"),\"\")","v":""},{"$f":"IF(CONCATENATE(C$7,W$3)=Matriz!$J$126,CONCATENATE(Matriz!A126,\" - P1 I4\"),\"\")","v":""},{"$f":"IF(CONCATENATE(C$7,W$3)=Matriz!$J$198,CONCATENATE(Matriz!A198,\" - P1 I4\"),\"\")","v":""},{"$f":"IF(CONCATENATE(C$7,W$3)=Matriz!$J$270,CONCATENATE(Matriz!A270,\" - P1 I4\"),\"\")","v":""},{"$f":"IF(CONCATENATE(C$7,W$3)=Matriz!$J$342,CONCATENATE(Matriz!A342,\" - P1 I4\"),\"\")","v":""},{"$f":"IF(CONCATENATE(C$7,W$3)=Matriz!$J$414,CONCATENATE(Matriz!A414,\" - P1 I4\"),\"\")","v":""},{"$f":"IF(CONCATENATE(C$7,AC$3)=Matriz!$J$54,CONCATENATE(Matriz!A54,\" - P1 I5\"),\"\")","v":""},{"$f":"IF(CONCATENATE(C$7,AC$3)=Matriz!$J$126,CONCATENATE(Matriz!A126,\" - P1 I5\"),\"\")","v":""},{"$f":"IF(CONCATENATE(C$7,AC$3)=Matriz!$J$198,CONCATENATE(Matriz!A198,\" - P1 I5\"),\"\")","v":""},{"$f":"IF(CONCATENATE(C$7,AC$3)=Matriz!$J$270,CONCATENATE(Matriz!A270,\" - P1 I5\"),\"\")","v":""},{"$f":"IF(CONCATENATE(C$7,AC$3)=Matriz!$J$342,CONCATENATE(Matriz!A342,\" - P1 I5\"),\"\")","v":""},{"$f":"IF(CONCATENATE(C$7,AC$3)=Matriz!$J$414,CONCATENATE(Matriz!A414,\" - P1 I5\"),\"\")","v":""}]
[{"$nulls":4},{"$f":"IF(CONCATENATE(C$7,E$3)=Matriz!$J$63,CONCATENATE(Matriz!A63,\" - P1 I1\"),\"\")","v":""},{"$f":"IF(CONCATENATE(C$7,E$3)=Matriz!$J$135,CONCATENATE(Matriz!A135,\" - P1 I1\"),\"\")","v":""},{"$f":"IF(CONCATENATE(C$7,E$3)=Matriz!$J$207,CONCATENATE(Matriz!A207,\" - P1 I1\"),\"\")","v":""},{"$f":"IF(CONCATENATE(C$7,E$3)=Matriz!$J$279,CONCATENATE(Matriz!A279,\" - P1 I1\"),\"\")","v":""},{"$f":"IF(CONCATENATE(C$7,E$3)=Matriz!$J$351,CONCATENATE(Matriz!A351,\" - P1 I1\"),\"\")","v":""},{"$f":"IF(CONCATENATE(C$7,E$3)=Matriz!$J$423,CONCATENATE(Matriz!A423,\" - P1 I1\"),\"\")","v":""},{"$f":"IF(CONCATENATE(B$7,J$3)=Matriz!$J$63,CONCATENATE(Matriz!A63,\" - P1 I2\"),\"\")","v":""},{"$f":"IF(CONCATENATE(C$7,K$3)=Matriz!$J$135,CONCATENATE(Matriz!A135,\" - P1 I2\"),\"\")","v":""},{"$f":"IF(CONCATENATE(C$7,K$3)=Matriz!$J$207,CONCATENATE(Matriz!A207,\" - P1 I2\"),\"\")","v":""},{"$f":"IF(CONCATENATE(C$7,K$3)=Matriz!$J$279,CONCATENATE(Matriz!A279,\" - P1 I2\"),\"\")","v":""},{"$f":"IF(CONCATENATE(C$7,K$3)=Matriz!$J$351,CONCATENATE(Matriz!A351,\" - P1 I2\"),\"\")","v":""},{"$f":"IF(CONCATENATE(C$7,K$3)=Matriz!$J$423,CONCATENATE(Matriz!A423,\" - P1 I2\"),\"\")","v":""},{"$f":"IF(CONCATENATE(C$7,Q$3)=Matriz!$J$63,CONCATENATE(Matriz!A63,\" - P1 I3\"),\"\")","v":""},{"$f":"IF(CONCATENATE(C$7,Q$3)=Matriz!$J$135,CONCATENATE(Matriz!A135,\" - P1 I3\"),\"\")","v":""},{"$f":"IF(CONCATENATE(C$7,Q$3)=Matriz!$J$207,CONCATENATE(Matriz!A207,\" - P1 I3\"),\"\")","v":""},{"$f":"IF(CONCATENATE(C$7,Q$3)=Matriz!$J$279,CONCATENATE(Matriz!A279,\" - P1 I3\"),\"\")","v":""},{"$f":"IF(CONCATENATE(C$7,Q$3)=Matriz!$J$351,CONCATENATE(Matriz!A351,\" - P1 I3\"),\"\")","v":"R39 - P1 I3"},{"$f":"IF(CONCATENATE(C$7,Q$3)=Matriz!$J$423,CONCATENATE(Matriz!A423,\" - P1 I3\"),\"\")","v":""},{"$f":"IF(CONCATENATE(C$7,W$3)=Matriz!$J$63,CONCATENATE(Matriz!A63,\" - P1 I4\"),\"\")","v":""},{"$f":"IF(CONCATENATE(C$7,W$3)=Matriz!$J$135,CONCATENATE(Matriz!A135,\" - P1 I4\"),\"\")","v":""},{"$f":"IF(CONCATENATE(C$7,W$3)=Matriz!$J$207,CONCATENATE(Matriz!A207,\" - P1 I4\"),\"\")","v":""},{"$f":"IF(CONCATENATE(C$7,W$3)=Matriz!$J$279,CONCATENATE(Matriz!A279,\" - P1 I4\"),\"\")","v":""},{"$f":"IF(CONCATENATE(C$7,W$3)=Matriz!$J$351,CONCATENATE(Matriz!A351,\" - P1 I4\"),\"\")","v":""},{"$f":"IF(CONCATENATE(C$7,W$3)=Matriz!$J$423,CONCATENATE(Matriz!A423,\" - P1 I4\"),\"\")","v":""},{"$f":"IF(CONCATENATE(C$7,AC$3)=Matriz!$J$63,CONCATENATE(Matriz!A63,\" - P1 I5\"),\"\")","v":""},{"$f":"IF(CONCATENATE(C$7,AC$3)=Matriz!$J$135,CONCATENATE(Matriz!A135,\" - P1 I5\"),\"\")","v":""},{"$f":"IF(CONCATENATE(C$7,AC$3)=Matriz!$J$207,CONCATENATE(Matriz!A207,\" - P1 I5\"),\"\")","v":""},{"$f":"IF(CONCATENATE(C$7,AC$3)=Matriz!$J$279,CONCATENATE(Matriz!A279,\" - P1 I5\"),\"\")","v":""},{"$f":"IF(CONCATENATE(C$7,AC$3)=Matriz!$J$351,CONCATENATE(Matriz!A351,\" - P1 I5\"),\"\")","v":""},{"$f":"IF(CONCATENATE(C$7,AC$3)=Matriz!$J$423,CONCATENATE(Matriz!A423,\" - P1 I5\"),\"\")","v":""}]
[{"$nulls":4},{"$f":"IF(CONCATENATE(C$7,E$3)=Matriz!$J$72,CONCATENATE(Matriz!A72,\" - P1 I1\"),\"\")","v":""},{"$f":"IF(CONCATENATE(C$7,E$3)=Matriz!$J$144,CONCATENATE(Matriz!A144,\" - P1 I1\"),\"\")","v":""},{"$f":"IF(CONCATENATE(C$7,E$3)=Matriz!$J$216,CONCATENATE(Matriz!A216,\" - P1 I1\"),\"\")","v":""},{"$f":"IF(CONCATENATE(C$7,E$3)=Matriz!$J$288,CONCATENATE(Matriz!A288,\" - P1 I1\"),\"\")","v":""},{"$f":"IF(CONCATENATE(C$7,E$3)=Matriz!$J$360,CONCATENATE(Matriz!A360,\" - P1 I1\"),\"\")","v":""},{"$f":"IF(CONCATENATE(C$7,E$3)=Matriz!$J$432,CONCATENATE(Matriz!A432,\" - P1 I1\"),\"\")","v":""},{"$f":"IF(CONCATENATE(B$7,J$3)=Matriz!$J$72,CONCATENATE(Matriz!A72,\" - P1 I2\"),\"\")","v":""},{"$f":"IF(CONCATENATE(C$7,K$3)=Matriz!$J$144,CONCATENATE(Matriz!A144,\" - P1 I2\"),\"\")","v":""},{"$f":"IF(CONCATENATE(C$7,K$3)=Matriz!$J$216,CONCATENATE(Matriz!A216,\" - P1 I2\"),\"\")","v":""},{"$f":"IF(CONCATENATE(C$7,K$3)=Matriz!$J$288,CONCATENATE(Matriz!A288,\" - P1 I2\"),\"\")","v":""},{"$f":"IF(CONCATENATE(C$7,K$3)=Matriz!$J$360,CONCATENATE(Matriz!A360,\" - P1 I2\"),\"\")","v":""},{"$f":"IF(CONCATENATE(C$7,K$3)=Matriz!$J$432,CONCATENATE(Matriz!A432,\" - P1 I2\"),\"\")","v":""},{"$f":"IF(CONCATENATE(C$7,Q$3)=Matriz!$J$72,CONCATENATE(Matriz!A72,\" - P1 I3\"),\"\")","v":""},{"$f":"IF(CONCATENATE(C$7,Q$3)=Matriz!$J$144,CONCATENATE(Matriz!A144,\" - P1 I3\"),\"\")","v":""},{"$f":"IF(CONCATENATE(C$7,Q$3)=Matriz!$J$216,CONCATENATE(Matriz!A216,\" - P1 I3\"),\"\")","v":""},{"$f":"IF(CONCATENATE(C$7,Q$3)=Matriz!$J$288,CONCATENATE(Matriz!A288,\" - P1 I3\"),\"\")","v":""},{"$f":"IF(CONCATENATE(C$7,Q$3)=Matriz!$J$360,CONCATENATE(Matriz!A360,\" - P1 I3\"),\"\")","v":""},{"$f":"IF(CONCATENATE(C$7,Q$3)=Matriz!$J$432,CONCATENATE(Matriz!A432,\" - P1 I3\"),\"\")","v":""},{"$f":"IF(CONCATENATE(C$7,W$3)=Matriz!$J$72,CONCATENATE(Matriz!A72,\" - P1 I4\"),\"\")","v":""},{"$f":"IF(CONCATENATE(C$7,W$3)=Matriz!$J$144,CONCATENATE(Matriz!A144,\" - P1 I4\"),\"\")","v":""},{"$f":"IF(CONCATENATE(C$7,W$3)=Matriz!$J$216,CONCATENATE(Matriz!A216,\" - P1 I4\"),\"\")","v":""},{"$f":"IF(CONCATENATE(C$7,W$3)=Matriz!$J$288,CONCATENATE(Matriz!A288,\" - P1 I4\"),\"\")","v":""},{"$f":"IF(CONCATENATE(C$7,W$3)=Matriz!$J$360,CONCATENATE(Matriz!A360,\" - P1 I4\"),\"\")","v":""},{"$f":"IF(CONCATENATE(C$7,W$3)=Matriz!$J$432,CONCATENATE(Matriz!A432,\" - P1 I4\"),\"\")","v":""},{"$f":"IF(CONCATENATE(C$7,AC$3)=Matriz!$J$72,CONCATENATE(Matriz!A72,\" - P1 I5\"),\"\")","v":""},{"$f":"IF(CONCATENATE(C$7,AC$3)=Matriz!$J$144,CONCATENATE(Matriz!A144,\" - P1 I5\"),\"\")","v":""},{"$f":"IF(CONCATENATE(C$7,AC$3)=Matriz!$J$216,CONCATENATE(Matriz!A216,\" - P1 I5\"),\"\")","v":""},{"$f":"IF(CONCATENATE(C$7,AC$3)=Matriz!$J$288,CONCATENATE(Matriz!A288,\" - P1 I5\"),\"\")","v":""},{"$f":"IF(CONCATENATE(C$7,AC$3)=Matriz!$J$360,CONCATENATE(Matriz!A360,\" - P1 I5\"),\"\")","v":""},{"$f":"IF(CONCATENATE(C$7,AC$3)=Matriz!$J$432,CONCATENATE(Matriz!A432,\" - P1 I5\"),\"\")","v":""}]
[{"$nulls":4},{"$f":"IF(CONCATENATE(C$15,E$3)=Matriz!$J$9,CONCATENATE(Matriz!A9,\" - P2 I1\"),\"\")","v":""},{"$f":"IF(CONCATENATE(C$15,E$3)=Matriz!$J$81,CONCATENATE(Matriz!A81,\" - P2 I1\"),\"\")","v":""},{"$f":"IF(CONCATENATE(C$15,E$3)=Matriz!$J$153,CONCATENATE(Matriz!A153,\" - P2 I1\"),\"\")","v":""},{"$f":"IF(CONCATENATE(C$15,E$3)=Matriz!$J$225,CONCATENATE(Matriz!A225,\" - P2 I1\"),\"\")","v":""},{"$f":"IF(CONCATENATE(C$15,E$3)=Matriz!$J$297,CONCATENATE(Matriz!A297,\" - P2 I1\"),\"\")","v":""},{"$f":"IF(CONCATENATE(C$15,E$3)=Matriz!$J$369,CONCATENATE(Matriz!A369,\" - P2 I1\"),\"\")","v":""},{"$f":"IF(CONCATENATE(C$15,K$3)=Matriz!$J$9,CONCATENATE(Matriz!A9,\" - P2 I2\"),\"\")","v":""},{"$f":"IF(CONCATENATE(C$15,K$3)=Matriz!$J$81,CONCATENATE(Matriz!A81,\" - P2 I2\"),\"\")","v":""},{"$f":"IF(CONCATENATE(C$15,K$3)=Matriz!$J$153,CONCATENATE(Matriz!A153,\" - P2 I2\"),\"\")","v":""},{"$f":"IF(CONCATENATE(C$15,K$3)=Matriz!$J$225,CONCATENATE(Matriz!A225,\" - P2 I2\"),\"\")","v":""},{"$f":"IF(CONCATENATE(C$15,K$3)=Matriz!$J$297,CONCATENATE(Matriz!A297,\" - P2 I2\"),\"\")","v":""},{"$f":"IF(CONCATENATE(C$15,K$3)=Matriz!$J$369,CONCATENATE(Matriz!A369,\" - P2 I2\"),\"\")","v":""},{"$f":"IF(CONCATENATE(C$15,Q$3)=Matriz!$J$9,CONCATENATE(Matriz!A9,\" - P2 I3\"),\"\")","v":""},{"$f":"IF(CONCATENATE(C$15,Q$3)=Matriz!$J$81,CONCATENATE(Matriz!A81,\" - P2 I3\"),\"\")","v":""},{"$f":"IF(CONCATENATE(C$15,Q$3)=Matriz!$J$153,CONCATENATE(Matriz!A153,\" - P2 I3\"),\"\")","v":""},{"$f":"IF(CONCATENATE(C$15,Q$3)=Matriz!$J$225,CONCATENATE(Matriz!A225,\" - P2 I3\"),\"\")","v":""},{"$f":"IF(CONCATENATE(C$15,Q$3)=Matriz!$J$297,CONCATENATE(Matriz!A297,\" - P2 I3\"),\"\")","v":""},{"$f":"IF(CONCATENATE(C$15,Q$3)=Matriz!$J$369,CONCATENATE(Matriz!A369,\" - P2 I3\"),\"\")","v":""},{"$f":"IF(CONCATENATE(C$15,W$3)=Matriz!$J$9,CONCATENATE(Matriz!A9,\" - P2 I4\"),\"\")","v":""},{"$f":"IF(CONCATENATE(C$15,W$3)=Matriz!$J$81,CONCATENATE(Matriz!A81,\" - P2 I4\"),\"\")","v":""},{"$f":"IF(CONCATENATE(C$15,W$3)=Matriz!$J$153,CONCATENATE(Matriz!A153,\" - P2 I4\"),\"\")","v":""},{"$f":"IF(CONCATENATE(C$15,W$3)=Matriz!$J$225,CONCATENATE(Matriz!A225,\" - P2 I4\"),\"\")","v":""},{"$f":"IF(CONCATENATE(C$15,W$3)=Matriz!$J$297,CONCATENATE(Matriz!A297,\" - P2 I4\"),\"\")","v":""},{"$f":"IF(CONCATENATE(C$15,W$3)=Matriz!$J$369,CONCATENATE(Matriz!A369,\" - P2 I4\"),\"\")","v":""},{"$f":"IF(CONCATENATE(C$15,AC$3)=Matriz!$J$9,CONCATENATE(Matriz!A9,\" - P2 I5\"),\"\")","v":""},{"$f":"IF(CONCATENATE(C$15,AC$3)=Matriz!$J$81,CONCATENATE(Matriz!A81,\" - P2 I5\"),\"\")","v":""},{"$f":"IF(CONCATENATE(C$15,AC$3)=Matriz!$J$153,CONCATENATE(Matriz!A153,\" - P2 I5\"),\"\")","v":""},{"$f":"IF(CONCATENATE(C$15,AC$3)=Matriz!$J$225,CONCATENATE(Matriz!A225,\" - P2 I5\"),\"\")","v":""},{"$f":"IF(CONCATENATE(C$15,AC$3)=Matriz!$J$297,CONCATENATE(Matriz!A297,\" - P2 I5\"),\"\")","v":""},{"$f":"IF(CONCATENATE(C$15,AC$3)=Matriz!$J$369,CONCATENATE(Matriz!A369,\" - P2 I5\"),\"\")","v":""},{"$nulls":5},9,6,54]
[null,null,2,"IMPROBABLE",{"$f":"IF(CONCATENATE(C$15,E$3)=Matriz!$J$18,CONCATENATE(Matriz!A18,\" - P2 I1\"),\"\")","v":""},{"$f":"IF(CONCATENATE(C$15,E$3)=Matriz!$J$90,CONCATENATE(Matriz!A90,\" - P2 I1\"),\"\")","v":""},{"$f":"IF(CONCATENATE(C$15,E$3)=Matriz!$J$162,CONCATENATE(Matriz!A162,\" - P2 I1\"),\"\")","v":""},{"$f":"IF(CONCATENATE(C$15,E$3)=Matriz!$J$234,CONCATENATE(Matriz!A234,\" - P2 I1\"),\"\")","v":""},{"$f":"IF(CONCATENATE(C$15,E$3)=Matriz!$J$306,CONCATENATE(Matriz!A306,\" - P2 I1\"),\"\")","v":""},{"$f":"IF(CONCATENATE(C$15,E$3)=Matriz!$J$378,CONCATENATE(Matriz!A378,\" - P2 I1\"),\"\")","v":""},{"$f":"IF(CONCATENATE(C$15,K$3)=Matriz!$J$18,CONCATENATE(Matriz!A18,\" - P2 I2\"),\"\")","v":""},{"$f":"IF(CONCATENATE(C$15,K$3)=Matriz!$J$90,CONCATENATE(Matriz!A90,\" - P2 I2\"),\"\")","v":""},{"$f":"IF(CONCATENATE(C$15,K$3)=Matriz!$J$162,CONCATENATE(Matriz!A162,\" - P2 I2\"),\"\")","v":""},{"$f":"IF(CONCATENATE(C$15,K$3)=Matriz!$J$234,CONCATENATE(Matriz!A234,\" - P2 I2\"),\"\")","v":""},{"$f":"IF(CONCATENATE(C$15,K$3)=Matriz!$J$306,CONCATENATE(Matriz!A306,\" - P2 I2\"),\"\")","v":""},{"$f":"IF(CONCATENATE(C$15,K$3)=Matriz!$J$378,CONCATENATE(Matriz!A378,\" - P2 I2\"),\"\")","v":""},{"$f":"IF(CONCATENATE(C$15,Q$3)=Matriz!$J$18,CONCATENATE(Matriz!A18,\" - P2 I3\"),\"\")","v":""},{"$f":"IF(CONCATENATE(C$15,Q$3)=Matriz!$J$90,CONCATENATE(Matriz!A90,\" - P2 I3\"),\"\")","v":""},{"$f":"IF(CONCATENATE(C$15,Q$3)=Matriz!$J$162,CONCATENATE(Matriz!A162,\" - P2 I3\"),\"\")","v":""},{"$f":"IF(CONCATENATE(C$15,Q$3)=Matriz!$J$234,CONCATENATE(Matriz!A234,\" - P2 I3\"),\"\")","v":""},{"$f":"IF(CONCATENATE(C$15,Q$3)=Matriz!$J$306,CONCATENATE(Matriz!A306,\" - P2 I3\"),\"\")","v":""},{"$f":"IF(CONCATENATE(C$15,Q$3)=Matriz!$J$378,CONCATENATE(Matriz!A378,\" - P2 I3\"),\"\")","v":""},{"$f":"IF(CONCATENATE(C$15,W$3)=Matriz!$J$18,CONCATENATE(Matriz!A18,\" - P2 I4\"),\"\")","v":""},{"$f":"IF(CONCATENATE(C$15,W$3)=Matriz!$J$90,CONCATENATE(Matriz!A90,\" - P2 I4\"),\"\")","v":""},{"$f":"IF(CONCATENATE(C$15,W$3)=Matriz!$J$162,CONCATENATE(Matriz!A162,\" - P2 I4\"),\"\")","v":""},{"$f":"IF(CONCATENATE(C$15,W$3)=Matriz!$J$234,CONCATENATE(Matriz!A234,\" - P2 I4\"),\"\")","v":""},{"$f":"IF(CONCATENATE(C$15,W$3)=Matriz!$J$306,CONCATENATE(Matriz!A306,\" - P2 I4\"),\"\")","v":""},{"$f":"IF(CONCATENATE(C$15,W$3)=Matriz!$J$378,CONCATENATE(Matriz!A378,\" - P2 I4\"),\"\")","v":""},{"$f":"IF(CONCATENATE(C$15,AC$3)=Matriz!$J$18,CONCATENATE(Matriz!A18,\" - P2 I5\"),\"\")","v":""},{"$f":"IF(CONCATENATE(C$15,AC$3)=Matriz!$J$90,CONCATENATE(Matriz!A90,\" - P2 I5\"),\"\")","v":""},{"$f":"IF(CONCATENATE(C$15,AC$3)=Matriz!$J$162,CONCATENATE(Matriz!A162,\" - P2 I5\"),\"\")","v":""},{"$f":"IF(CONCATENATE(C$15,AC$3)=Matriz!$J$234,CONCATENATE(Matriz!A234,\" - P2 I5\"),\"\")","v":""},{"$f":"IF(CONCATENATE(C$15,AC$3)=Matriz!$J$306,CONCATENATE(Matriz!A306,\" - P2 I5\"),\"\")","v":""},{"$f":"IF(CONCATENATE(C$15,AC$3)=Matriz!$J$378,CONCATENATE(Matriz!A378,\" - P2 I5\"),\"\")","v":""}]
[{"$nulls":4},{"$f":"IF(CONCATENATE(C$15,E$3)=Matriz!$J$27,CONCATENATE(Matriz!A27,\" - P2 I1\"),\"\")","v":""},{"$f":"IF(CONCATENATE(C$15,E$3)=Matriz!$J$99,CONCATENATE(Matriz!A99,\" - P2 I1\"),\"\")","v":""},{"$f":"IF(CONCATENATE(C$15,E$3)=Matriz!$J$171,CONCATENATE(Matriz!A171,\" - P2 I1\"),\"\")","v":""},{"$f":"IF(CONCATENATE(C$15,E$3)=Matriz!$J$243,CONCATENATE(Matriz!A243,\" - P2 I1\"),\"\")","v":""},{"$f":"IF(CONCATENATE(C$15,E$3)=Matriz!$J$315,CONCATENATE(Matriz!A315,\" - P2 I1\"),\"\")","v":""},{"$f":"IF(CONCATENATE(C$15,E$3)=Matriz!$J$387,CONCATENATE(Matriz!A387,\" - P2 I1\"),\"\")","v":""},{"$f":"IF(CONCATENATE(C$15,K$3)=Matriz!$J$27,CONCATENATE(Matriz!A27,\" - P2 I2\"),\"\")","v":""},{"$f":"IF(CONCATENATE(C$15,K$3)=Matriz!$J$99,CONCATENATE(Matriz!A99,\" - P2 I2\"),\"\")","v":""},{"$f":"IF(CONCATENATE(C$15,K$3)=Matriz!$J$171,CONCATENATE(Matriz!A171,\" - P2 I2\"),\"\")","v":""},{"$f":"IF(CONCATENATE(C$15,K$3)=Matriz!$J$243,CONCATENATE(Matriz!A243,\" - P2 I2\"),\"\")","v":""},{"$f":"IF(CONCATENATE(C$15,K$3)=Matriz!$J$315,CONCATENATE(Matriz!A315,\" - P2 I2\"),\"\")","v":""},{"$f":"IF(CONCATENATE(C$15,K$3)=Matriz!$J$387,CONCATENATE(Matriz!A387,\" - P2 I2\"),\"\")","v":""},{"$f":"IF(CONCATENATE(C$15,Q$3)=Matriz!$J$27,CONCATENATE(Matriz!A27,\" - P2 I3\"),\"\")","v":""},{"$f":"IF(CONCATENATE(C$15,Q$3)=Matriz!$J$99,CONCATENATE(Matriz!A99,\" - P2 I3\"),\"\")","v":""},{"$f":"IF(CONCATENATE(C$15,Q$3)=Matriz!$J$171,CONCATENATE(Matriz!A171,\" - P2 I3\"),\"\")","v":""},{"$f":"IF(CONCATENATE(C$15,Q$3)=Matriz!$J$243,CONCATENATE(Matriz!A243,\" - P2 I3\"),\"\")","v":""},{"$f":"IF(CONCATENATE(C$15,Q$3)=Matriz!$J$315,CONCATENATE(Matriz!A315,\" - P2 I3\"),\"\")","v":""},{"$f":"IF(CONCATENATE(C$15,Q$3)=Matriz!$J$387,CONCATENATE(Matriz!A387,\" - P2 I3\"),\"\")","v":""},{"$f":"IF(CONCATENATE(C$15,W$3)=Matriz!$J$27,CONCATENATE(Matriz!A27,\" - P2 I4\"),\"\")","v":""},{"$f":"IF(CONCATENATE(C$15,W$3)=Matriz!$J$99,CONCATENATE(Matriz!A99,\" - P2 I4\"),\"\")","v":""},{"$f":"IF(CONCATENATE(C$15,W$3)=Matriz!$J$171,CONCATENATE(Matriz!A171,\" - P2 I4\"),\"\")","v":""},{"$f":"IF(CONCATENATE(C$15,W$3)=Matriz!$J$243,CONCATENATE(Matriz!A243,\" - P2 I4\"),\"\")","v":""},{"$f":"IF(CONCATENATE(C$15,W$3)=Matriz!$J$315,CONCATENATE(Matriz!A315,\" - P2 I4\"),\"\")","v":""},{"$f":"IF(CONCATENATE(C$15,W$3)=Matriz!$J$387,CONCATENATE(Matriz!A387,\" - P2 I4\"),\"\")","v":""},{"$f":"IF(CONCATENATE(C$15,AC$3)=Matriz!$J$27,CONCATENATE(Matriz!A27,\" - P2 I5\"),\"\")","v":""},{"$f":"IF(CONCATENATE(C$15,AC$3)=Matriz!$J$99,CONCATENATE(Matriz!A99,\" - P2 I5\"),\"\")","v":""},{"$f":"IF(CONCATENATE(C$15,AC$3)=Matriz!$J$171,CONCATENATE(Matriz!A171,\" - P2 I5\"),\"\")","v":""},{"$f":"IF(CONCATENATE(C$15,AC$3)=Matriz!$J$243,CONCATENATE(Matriz!A243,\" - P2 I5\"),\"\")","v":""},{"$f":"IF(CONCATENATE(C$15,AC$3)=Matriz!$J$315,CONCATENATE(Matriz!A315,\" - P2 I5\"),\"\")","v":""},{"$f":"IF(CONCATENATE(C$15,AC$3)=Matriz!$J$387,CONCATENATE(Matriz!A387,\" - P2 I5\"),\"\")","v":""}]
[{"$nulls":4},{"$f":"IF(CONCATENATE(C$15,E$3)=Matriz!$J$36,CONCATENATE(Matriz!A36,\" - P2 I1\"),\"\")","v":""},{"$f":"IF(CONCATENATE(C$15,E$3)=Matriz!$J$108,CONCATENATE(Matriz!A108,\" - P2 I1\"),\"\")","v":""},{"$f":"IF(CONCATENATE(C$15,E$3)=Matriz!$J$180,CONCATENATE(Matriz!A180,\" - P2 I1\"),\"\")","v":""},{"$f":"IF(CONCATENATE(C$15,E$3)=Matriz!$J$252,CONCATENATE(Matriz!A252,\" - P2 I1\"),\"\")","v":""},{"$f":"IF(CONCATENATE(C$15,E$3)=Matriz!$J$324,CONCATENATE(Matriz!A324,\" - P2 I1\"),\"\")","v":""},{"$f":"IF(CONCATENATE(C$15,E$3)=Matriz!$J$396,CONCATENATE(Matriz!A396,\" - P2 I1\"),\"\")","v":""},{"$f":"IF(CONCATENATE(C$15,K$3)=Matriz!$J$36,CONCATENATE(Matriz!A36,\" - P2 I2\"),\"\")","v":""},{"$f":"IF(CONCATENATE(C$15,K$3)=Matriz!$J$108,CONCATENATE(Matriz!A108,\" - P2 I2\"),\"\")","v":""},{"$f":"IF(CONCATENATE(C$15,K$3)=Matriz!$J$180,CONCATENATE(Matriz!A180,\" - P2 I2\"),\"\")","v":""},{"$f":"IF(CONCATENATE(C$15,K$3)=Matriz!$J$252,CONCATENATE(Matriz!A252,\" - P2 I2\"),\"\")","v":""},{"$f":"IF(CONCATENATE(C$15,K$3)=Matriz!$J$324,CONCATENATE(Matriz!A324,\" - P2 I2\"),\"\")","v":""},{"$f":"IF(CONCATENATE(C$15,K$3)=Matriz!$J$396,CONCATENATE(Matriz!A396,\" - P2 I2\"),\"\")","v":""},{"$f":"IF(CONCATENATE(C$15,Q$3)=Matriz!$J$36,CONCATENATE(Matriz!A36,\" - P2 I3\"),\"\")","v":""},{"$f":"IF(CONCATENATE(C$15,Q$3)=Matriz!$J$108,CONCATENATE(Matriz!A108,\" - P2 I3\"),\"\")","v":""},{"$f":"IF(CONCATENATE(C$15,Q$3)=Matriz!$J$180,CONCATENATE(Matriz!A180,\" - P2 I3\"),\"\")","v":""},{"$f":"IF(CONCATENATE(C$15,Q$3)=Matriz!$J$252,CONCATENATE(Matriz!A252,\" - P2 I3\"),\"\")","v":""},{"$f":"IF(CONCATENATE(C$15,Q$3)=Matriz!$J$324,CONCATENATE(Matriz!A324,\" - P2 I3\"),\"\")","v":""},{"$f":"IF(CONCATENATE(C$15,Q$3)=Matriz!$J$396,CONCATENATE(Matriz!A396,\" - P2 I3\"),\"\")","v":""},{"$f":"IF(CONCATENATE(C$15,W$3)=Matriz!$J$36,CONCATENATE(Matriz!A36,\" - P2 I4\"),\"\")","v":""},{"$f":"IF(CONCATENATE(C$15,W$3)=Matriz!$J$108,CONCATENATE(Matriz!A108,\" - P2 I4\"),\"\")","v":""},{"$f":"IF(CONCATENATE(C$15,W$3)=Matriz!$J$180,CONCATENATE(Matriz!A180,\" - P2 I4\"),\"\")","v":""},{"$f":"IF(CONCATENATE(C$15,W$3)=Matriz!$J$252,CONCATENATE(Matriz!A252,\" - P2 I4\"),\"\")","v":""},{"$f":"IF(CONCATENATE(C$15,W$3)=Matriz!$J$324,CONCATENATE(Matriz!A324,\" - P2 I4\"),\"\")","v":""},{"$f":"IF(CONCATENATE(C$15,W$3)=Matriz!$J$396,CONCATENATE(Matriz!A396,\" - P2 I4\"),\"\")","v":""},{"$f":"IF(CONCATENATE(C$15,AC$3)=Matriz!$J$36,CONCATENATE(Matriz!A36,\" - P2 I5\"),\"\")","v":""},{"$f":"IF(CONCATENATE(C$15,AC$3)=Matriz!$J$108,CONCATENATE(Matriz!A108,\" - P2 I5\"),\"\")","v":""},{"$f":"IF(CONCATENATE(C$15,AC$3)=Matriz!$J$180,CONCATENATE(Matriz!A180,\" - P2 I5\"),\"\")","v":""},{"$f":"IF(CONCATENATE(C$15,AC$3)=Matriz!$J$252,CONCATENATE(Matriz!A252,\" - P2 I5\"),\"\")","v":""},{"$f":"IF(CONCATENATE(C$15,AC$3)=Matriz!$J$324,CONCATENATE(Matriz!A324,\" - P2 I5\"),\"\")","v":""},{"$f":"IF(CONCATENATE(C$15,AC$3)=Matriz!$J$396,CONCATENATE(Matriz!A396,\" - P2 I5\"),\"\")","v":""}]
[{"$nulls":4},{"$f":"IF(CONCATENATE(C$15,E$3)=Matriz!$J$45,CONCATENATE(Matriz!A45,\" - P2 I1\"),\"\")","v":""},{"$f":"IF(CONCATENATE(C$15,E$3)=Matriz!$J$117,CONCATENATE(Matriz!A117,\" - P2 I1\"),\"\")","v":""},{"$f":"IF(CONCATENATE(C$15,E$3)=Matriz!$J$189,CONCATENATE(Matriz!A189,\" - P2 I1\"),\"\")","v":""},{"$f":"IF(CONCATENATE(C$15,E$3)=Matriz!$J$261,CONCATENATE(Matriz!A261,\" - P2 I1\"),\"\")","v":""},{"$f":"IF(CONCATENATE(C$15,E$3)=Matriz!$J$333,CONCATENATE(Matriz!A333,\" - P2 I1\"),\"\")","v":""},{"$f":"IF(CONCATENATE(C$15,E$3)=Matriz!$J$405,CONCATENATE(Matriz!A405,\" - P2 I1\"),\"\")","v":""},{"$f":"IF(CONCATENATE(C$15,K$3)=Matriz!$J$45,CONCATENATE(Matriz!A45,\" - P2 I2\"),\"\")","v":""},{"$f":"IF(CONCATENATE(C$15,K$3)=Matriz!$J$117,CONCATENATE(Matriz!A117,\" - P2 I2\"),\"\")","v":""},{"$f":"IF(CONCATENATE(C$15,K$3)=Matriz!$J$189,CONCATENATE(Matriz!A189,\" - P2 I2\"),\"\")","v":""},{"$f":"IF(CONCATENATE(C$15,K$3)=Matriz!$J$261,CONCATENATE(Matriz!A261,\" - P2 I2\"),\"\")","v":""},{"$f":"IF(CONCATENATE(C$15,K$3)=Matriz!$J$333,CONCATENATE(Matriz!A333,\" - P2 I2\"),\"\")","v":""},{"$f":"IF(CONCATENATE(C$15,K$3)=Matriz!$J$405,CONCATENATE(Matriz!A405,\" - P2 I2\"),\"\")","v":""},{"$f":"IF(CONCATENATE(C$15,Q$3)=Matriz!$J$45,CONCATENATE(Matriz!A45,\" - P2 I3\"),\"\")","v":""},{"$f":"IF(CONCATENATE(C$15,Q$3)=Matriz!$J$117,CONCATENATE(Matriz!A117,\" - P2 I3\"),\"\")","v":""},{"$f":"IF(CONCATENATE(C$15,Q$3)=Matriz!$J$189,CONCATENATE(Matriz!A189,\" - P2 I3\"),\"\")","v":""},{"$f":"IF(CONCATENATE(C$15,Q$3)=Matriz!$J$261,CONCATENATE(Matriz!A261,\" - P2 I3\"),\"\")","v":""},{"$f":"IF(CONCATENATE(C$15,Q$3)=Matriz!$J$333,CONCATENATE(Matriz!A333,\" - P2 I3\"),\"\")","v":""},{"$f":"IF(CONCATENATE(C$15,Q$3)=Matriz!$J$405,CONCATENATE(Matriz!A405,\" - P2 I3\"),\"\")","v":""},{"$f":"IF(CONCATENATE(C$15,W$3)=Matriz!$J$45,CONCATENATE(Matriz!A45,\" - P2 I4\"),\"\")","v":""},{"$f":"IF(CONCATENATE(C$15,W$3)=Matriz!$J$117,CONCATENATE(Matriz!A117,\" - P2 I4\"),\"\")","v":""},{"$f":"IF(CONCATENATE(C$15,W$3)=Matriz!$J$189,CONCATENATE(Matriz!A189,\" - P2 I4\"),\"\")","v":""},{"$f":"IF(CONCATENATE(C$15,W$3)=Matriz!$J$261,CONCATENATE(Matriz!A261,\" - P2 I4\"),\"\")","v":""},{"$f":"IF(CONCATENATE(C$15,W$3)=Matriz!$J$333,CONCATENATE(Matriz!A333,\" - P2 I4\"),\"\")","v":""},{"$f":"IF(CONCATENATE(C$15,W$3)=Matriz!$J$405,CONCATENATE(Matriz!A405,\" - P2 I4\"),\"\")","v":""},{"$f":"IF(CONCATENATE(C$15,AC$3)=Matriz!$J$45,CONCATENATE(Matriz!A45,\" - P2 I5\"),\"\")","v":""},{"$f":"IF(CONCATENATE(C$15,AC$3)=Matriz!$J$117,CONCATENATE(Matriz!A117,\" - P2 I5\"),\"\")","v":""},{"$f":"IF(CONCATENATE(C$15,AC$3)=Matriz!$J$189,CONCATENATE(Matriz!A189,\" - P2 I5\"),\"\")","v":""},{"$f":"IF(CONCATENATE(C$15,AC$3)=Matriz!$J$261,CONCATENATE(Matriz!A261,\" - P2 I5\"),\"\")","v":""},{"$f":"IF(CONCATENATE(C$15,AC$3)=Matriz!$J$333,CONCATENATE(Matriz!A333,\" - P2 I5\"),\"\")","v":""},{"$f":"IF(CONCATENATE(C$15,AC$3)=Matriz!$J$405,CONCATENATE(Matriz!A405,\" - P2 I5\"),\"\")","v":""},{"$nulls":5},9,7,63]
[{"$nulls":4},{"$f":"IF(CONCATENATE(C$15,E$3)=Matriz!$J$54,CONCATENATE(Matriz!A54,\" - P2 I1\"),\"\")","v":""},{"$f":"IF(CONCATENATE(C$15,E$3)=Matriz!$J$126,CONCATENATE(Matriz!A126,\" - P2 I1\"),\"\")","v":""},{"$f":"IF(CONCATENATE(C$15,E$3)=Matriz!$J$198,CONCATENATE(Matriz!A198,\" - P2 I1\"),\"\")","v":""},{"$f":"IF(CONCATENATE(C$15,E$3)=Matriz!$J$270,CONCATENATE(Matriz!A270,\" - P2 I1\"),\"\")","v":""},{"$f":"IF(CONCATENATE(C$15,E$3)=Matriz!$J$342,CONCATENATE(Matriz!A342,\" - P2 I1\"),\"\")","v":""},{"$f":"IF(CONCATENATE(C$15,E$3)=Matriz!$J$414,CONCATENATE(Matriz!A414,\" - P2 I1\"),\"\")","v":""},{"$f":"IF(CONCATENATE(C$15,K$3)=Matriz!$J$54,CONCATENATE(Matriz!A54,\" - P2 I2\"),\"\")","v":""},{"$f":"IF(CONCATENATE(C$15,K$3)=Matriz!$J$126,CONCATENATE(Matriz!A126,\" - P2 I2\"),\"\")","v":""},{"$f":"IF(CONCATENATE(C$15,K$3)=Matriz!$J$198,CONCATENATE(Matriz!A198,\" - P2 I2\"),\"\")","v":""},{"$f":"IF(CONCATENATE(C$15,K$3)=Matriz!$J$270,CONCATENATE(Matriz!A270,\" - P2 I2\"),\"\")","v":""},{"$f":"IF(CONCATENATE(C$15,K$3)=Matriz!$J$342,CONCATENATE(Matriz!A342,\" - P2 I2\"),\"\")","v":""},{"$f":"IF(CONCATENATE(C$15,K$3)=Matriz!$J$414,CONCATENATE(Matriz!A414,\" - P2 I2\"),\"\")","v":""},{"$f":"IF(CONCATENATE(C$15,Q$3)=Matriz!$J$54,CONCATENATE(Matriz!A54,\" - P2 I3\"),\"\")","v":""},{"$f":"IF(CONCATENATE(C$15,Q$3)=Matriz!$J$126,CONCATENATE(Matriz!A126,\" - P2 I3\"),\"\")","v":""},{"$f":"IF(CONCATENATE(C$15,Q$3)=Matriz!$J$198,CONCATENATE(Matriz!A198,\" - P2 I3\"),\"\")","v":""},{"$f":"IF(CONCATENATE(C$15,Q$3)=Matriz!$J$270,CONCATENATE(Matriz!A270,\" - P2 I3\"),\"\")","v":""},{"$f":"IF(CONCATENATE(C$15,Q$3)=Matriz!$J$342,CONCATENATE(Matriz!A342,\" - P2 I3\"),\"\")","v":""},{"$f":"IF(CONCATENATE(C$15,Q$3)=Matriz!$J$414,CONCATENATE(Matriz!A414,\" - P2 I3\"),\"\")","v":""},{"$f":"IF(CONCATENATE(C$15,W$3)=Matriz!$J$54,CONCATENATE(Matriz!A54,\" - P2 I4\"),\"\")","v":""},{"$f":"IF(CONCATENATE(C$15,W$3)=Matriz!$J$126,CONCATENATE(Matriz!A126,\" - P2 I4\"),\"\")","v":""},{"$f":"IF(CONCATENATE(C$15,W$3)=Matriz!$J$198,CONCATENATE(Matriz!A198,\" - P2 I4\"),\"\")","v":""},{"$f":"IF(CONCATENATE(C$15,W$3)=Matriz!$J$270,CONCATENATE(Matriz!A270,\" - P2 I4\"),\"\")","v":""},{"$f":"IF(CONCATENATE(C$15,W$3)=Matriz!$J$342,CONCATENATE(Matriz!A342,\" - P2 I4\"),\"\")","v":""},{"$f":"IF(CONCATENATE(C$15,W$3)=Matriz!$J$414,CONCATENATE(Matriz!A414,\" - P2 I4\"),\"\")","v":""},{"$f":"IF(CONCATENATE(C$15,AC$3)=Matriz!$J$54,CONCATENATE(Matriz!A54,\" - P2 I5\"),\"\")","v":""},{"$f":"IF(CONCATENATE(C$15,AC$3)=Matriz!$J$126,CONCATENATE(Matriz!A126,\" - P2 I5\"),\"\")","v":""},{"$f":"IF(CONCATENATE(C$15,AC$3)=Matriz!$J$198,CONCATENATE(Matriz!A198,\" - P2 I5\"),\"\")","v":""},{"$f":"IF(CONCATENATE(C$15,AC$3)=Matriz!$J$270,CONCATENATE(Matriz!A270,\" - P2 I5\"),\"\")","v":""},{"$f":"IF(CONCATENATE(C$15,AC$3)=Matriz!$J$342,CONCATENATE(Matriz!A342,\" - P2 I5\"),\"\")","v":""},{"$f":"IF(CONCATENATE(C$15,AC$3)=Matriz!$J$414,CONCATENATE(Matriz!A414,\" - P2 I5\"),\"\")","v":""},{"$nulls":5},9,8,72]
[{"$nulls":4},{"$f":"IF(CONCATENATE(C$15,E$3)=Matriz!$J$63,CONCATENATE(Matriz!A63,\" - P2 I1\"),\"\")","v":""},{"$f":"IF(CONCATENATE(C$15,E$3)=Matriz!$J$135,CONCATENATE(Matriz!A135,\" - P2 I1\"),\"\")","v":""},{"$f":"IF(CONCATENATE(C$15,E$3)=Matriz!$J$207,CONCATENATE(Matriz!A207,\" - P2 I1\"),\"\")","v":""},{"$f":"IF(CONCATENATE(C$15,E$3)=Matriz!$J$279,CONCATENATE(Matriz!A279,\" - P2 I1\"),\"\")","v":""},{"$f":"IF(CONCATENATE(C$15,E$3)=Matriz!$J$351,CONCATENATE(Matriz!A351,\" - P2 I1\"),\"\")","v":""},{"$f":"IF(CONCATENATE(C$15,E$3)=Matriz!$J$423,CONCATENATE(Matriz!A423,\" - P2 I1\"),\"\")","v":""},{"$f":"IF(CONCATENATE(C$15,K$3)=Matriz!$J$63,CONCATENATE(Matriz!A63,\" - P2 I2\"),\"\")","v":""},{"$f":"IF(CONCATENATE(C$15,K$3)=Matriz!$J$135,CONCATENATE(Matriz!A135,\" - P2 I2\"),\"\")","v":""},{"$f":"IF(CONCATENATE(C$15,K$3)=Matriz!$J$207,CONCATENATE(Matriz!A207,\" - P2 I2\"),\"\")","v":""},{"$f":"IF(CONCATENATE(C$15,K$3)=Matriz!$J$279,CONCATENATE(Matriz!A279,\" - P2 I2\"),\"\")","v":""},{"$f":"IF(CONCATENATE(C$15,K$3)=Matriz!$J$351,CONCATENATE(Matriz!A351,\" - P2 I2\"),\"\")","v":""},{"$f":"IF(CONCATENATE(C$15,K$3)=Matriz!$J$423,CONCATENATE(Matriz!A423,\" - P2 I2\"),\"\")","v":""},{"$f":"IF(CONCATENATE(C$15,Q$3)=Matriz!$J$63,CONCATENATE(Matriz!A63,\" - P2 I3\"),\"\")","v":""},{"$f":"IF(CONCATENATE(C$15,Q$3)=Matriz!$J$135,CONCATENATE(Matriz!A135,\" - P2 I3\"),\"\")","v":""},{"$f":"IF(CONCATENATE(C$15,Q$3)=Matriz!$J$207,CONCATENATE(Matriz!A207,\" - P2 I3\"),\"\")","v":""},{"$f":"IF(CONCATENATE(C$15,Q$3)=Matriz!$J$279,CONCATENATE(Matriz!A279,\" - P2 I3\"),\"\")","v":""},{"$f":"IF(CONCATENATE(C$15,Q$3)=Matriz!$J$351,CONCATENATE(Matriz!A351,\" - P2 I3\"),\"\")","v":""},{"$f":"IF(CONCATENATE(C$15,Q$3)=Matriz!$J$423,CONCATENATE(Matriz!A423,\" - P2 I3\"),\"\")","v":""},{"$f":"IF(CONCATENATE(C$15,W$3)=Matriz!$J$63,CONCATENATE(Matriz!A63,\" - P2 I4\"),\"\")","v":""},{"$f":"IF(CONCATENATE(C$15,W$3)=Matriz!$J$135,CONCATENATE(Matriz!A135,\" - P2 I4\"),\"\")","v":""},{"$f":"IF(CONCATENATE(C$15,W$3)=Matriz!$J$207,CONCATENATE(Matriz!A207,\" - P2 I4\"),\"\")","v":""},{"$f":"IF(CONCATENATE(C$15,W$3)=Matriz!$J$279,CONCATENATE(Matriz!A279,\" - P2 I4\"),\"\")","v":""},{"$f":"IF(CONCATENATE(C$15,W$3)=Matriz!$J$351,CONCATENATE(Matriz!A351,\" - P2 I4\"),\"\")","v":""},{"$f":"IF(CONCATENATE(C$15,W$3)=Matriz!$J$423,CONCATENATE(Matriz!A423,\" - P2 I4\"),\"\")","v":""},{"$f":"IF(CONCATENATE(C$15,AC$3)=Matriz!$J$63,CONCATENATE(Matriz!A63,\" - P2 I5\"),\"\")","v":""},{"$f":"IF(CONCATENATE(C$15,AC$3)=Matriz!$J$135,CONCATENATE(Matriz!A135,\" - P2 I5\"),\"\")","v":""},{"$f":"IF(CONCATENATE(C$15,AC$3)=Matriz!$J$207,CONCATENATE(Matriz!A207,\" - P2 I5\"),\"\")","v":""},{"$f":"IF(CONCATENATE(C$15,AC$3)=Matriz!$J$279,CONCATENATE(Matriz!A279,\" - P2 I5\"),\"\")","v":""},{"$f":"IF(CONCATENATE(C$15,AC$3)=Matriz!$J$351,CONCATENATE(Matriz!A351,\" - P2 I5\"),\"\")","v":""},{"$f":"IF(CONCATENATE(C$15,AC$3)=Matriz!$J$423,CONCATENATE(Matriz!A423,\" - P2 I5\"),\"\")","v":""},{"$nulls":5},9,9,{"$f":"AO20*AN20","v":81}]
[{"$nulls":4},{"$f":"IF(CONCATENATE(C$15,E$3)=Matriz!$J$72,CONCATENATE(Matriz!A72,\" - P2 I1\"),\"\")","v":""},{"$f":"IF(CONCATENATE(C$15,E$3)=Matriz!$J$144,CONCATENATE(Matriz!A144,\" - P2 I1\"),\"\")","v":""},{"$f":"IF(CONCATENATE(C$15,E$3)=Matriz!$J$216,CONCATENATE(Matriz!A216,\" - P2 I1\"),\"\")","v":""},{"$f":"IF(CONCATENATE(C$15,E$3)=Matriz!$J$288,CONCATENATE(Matriz!A288,\" - P2 I1\"),\"\")","v":""},{"$f":"IF(CONCATENATE(C$15,E$3)=Matriz!$J$360,CONCATENATE(Matriz!A360,\" - P2 I1\"),\"\")","v":""},{"$f":"IF(CONCATENATE(C$15,E$3)=Matriz!$J$432,CONCATENATE(Matriz!A432,\" - P2 I1\"),\"\")","v":""},{"$f":"IF(CONCATENATE(C$15,K$3)=Matriz!$J$72,CONCATENATE(Matriz!A72,\" - P2 I2\"),\"\")","v":""},{"$f":"IF(CONCATENATE(C$15,K$3)=Matriz!$J$144,CONCATENATE(Matriz!A144,\" - P2 I2\"),\"\")","v":""},{"$f":"IF(CONCATENATE(C$15,K$3)=Matriz!$J$216,CONCATENATE(Matriz!A216,\" - P2 I2\"),\"\")","v":""},{"$f":"IF(CONCATENATE(C$15,K$3)=Matriz!$J$288,CONCATENATE(Matriz!A288,\" - P2 I2\"),\"\")","v":""},{"$f":"IF(CONCATENATE(C$15,K$3)=Matriz!$J$360,CONCATENATE(Matriz!A360,\" - P2 I2\"),\"\")","v":""},{"$f":"IF(CONCATENATE(C$15,K$3)=Matriz!$J$432,CONCATENATE(Matriz!A432,\" - P2 I2\"),\"\")","v":""},{"$f":"IF(CONCATENATE(C$15,Q$3)=Matriz!$J$72,CONCATENATE(Matriz!A72,\" - P2 I3\"),\"\")","v":""},{"$f":"IF(CONCATENATE(C$15,Q$3)=Matriz!$J$144,CONCATENATE(Matriz!A144,\" - P2 I3\"),\"\")","v":""},{"$f":"IF(CONCATENATE(C$15,Q$3)=Matriz!$J$216,CONCATENATE(Matriz!A216,\" - P2 I3\"),\"\")","v":""},{"$f":"IF(CONCATENATE(C$15,Q$3)=Matriz!$J$288,CONCATENATE(Matriz!A288,\" - P2 I3\"),\"\")","v":""},{"$f":"IF(CONCATENATE(C$15,Q$3)=Matriz!$J$360,CONCATENATE(Matriz!A360,\" - P2 I3\"),\"\")","v":""},{"$f":"IF(CONCATENATE(C$15,Q$3)=Matriz!$J$432,CONCATENATE(Matriz!A432,\" - P2 I3\"),\"\")","v":""},{"$f":"IF(CONCATENATE(C$15,W$3)=Matriz!$J$72,CONCATENATE(Matriz!A72,\" - P2 I4\"),\"\")","v":""},{"$f":"IF(CONCATENATE(C$15,W$3)=Matriz!$J$144,CONCATENATE(Matriz!A144,\" - P2 I4\"),\"\")","v":""},{"$f":"IF(CONCATENATE(C$15,W$3)=Matriz!$J$216,CONCATENATE(Matriz!A216,\" - P2 I4\"),\"\")","v":""},{"$f":"IF(CONCATENATE(C$15,W$3)=Matriz!$J$288,CONCATENATE(Matriz!A288,\" - P2 I4\"),\"\")","v":""},{"$f":"IF(CONCATENATE(C$15,W$3)=Matriz!$J$360,CONCATENATE(Matriz!A360,\" - P2 I4\"),\"\")","v":""},{"$f":"IF(CONCATENATE(C$15,W$3)=Matriz!$J$432,CONCATENATE(Matriz!A432,\" - P2 I4\"),\"\")","v":""},{"$f":"IF(CONCATENATE(C$15,AC$3)=Matriz!$J$72,CONCATENATE(Matriz!A72,\" - P2 I5\"),\"\")","v":"R8 - P2 I5"},{"$f":"IF(CONCATENATE(C$15,AC$3)=Matriz!$J$144,CONCATENATE(Matriz!A144,\" - P2 I5\"),\"\")","v":""},{"$f":"IF(CONCATENATE(C$15,AC$3)=Matriz!$J$216,CONCATENATE(Matriz!A216,\" - P2 I5\"),\"\")","v":""},{"$f":"IF(CONCATENATE(C$15,AC$3)=Matriz!$J$288,CONCATENATE(Matriz!A288,\" - P2 I5\"),\"\")","v":""},{"$f":"IF(CONCATENATE(C$15,AC$3)=Matriz!$J$360,CONCATENATE(Matriz!A360,\" - P2 I5\"),\"\")","v":""},{"$f":"IF(CONCATENATE(C$15,AC$3)=Matriz!$J$432,CONCATENATE(Matriz!A432,\" - P2 I5\"),\"\")","v":""},{"$nulls":5},9,10,90]
[null,null,3,"MODERADO",{"$f":"IF(CONCATENATE(C$22,E$3)=Matriz!$J$9,CONCATENATE(Matriz!A9,\" - P3 I1\"),\"\")","v":""},{"$f":"IF(CONCATENATE(C$22,E$3)=Matriz!$J$81,CONCATENATE(Matriz!A81,\" - P3 I1\"),\"\")","v":""},{"$f":"IF(CONCATENATE(C$22,E$3)=Matriz!$J$153,CONCATENATE(Matriz!A153,\" - P3 I1\"),\"\")","v":""},{"$f":"IF(CONCATENATE(C$22,E$3)=Matriz!$J$225,CONCATENATE(Matriz!A225,\" - P3 I1\"),\"\")","v":""},{"$f":"IF(CONCATENATE(C$22,E$3)=Matriz!$J$297,CONCATENATE(Matriz!A297,\" - P3 I1\"),\"\")","v":""},{"$f":"IF(CONCATENATE(C$22,E$3)=Matriz!$J$369,CONCATENATE(Matriz!A369,\" - P3 I1\"),\"\")","v":""},{"$f":"IF(CONCATENATE(C$22,K$3)=Matriz!$J$9,CONCATENATE(Matriz!A9,\" - P3 I2\"),\"\")","v":""},{"$f":"IF(CONCATENATE(C$22,K$3)=Matriz!$J$81,CONCATENATE(Matriz!A81,\" - P3 I2\"),\"\")","v":""},{"$f":"IF(CONCATENATE(C$22,K$3)=Matriz!$J$153,CONCATENATE(Matriz!A153,\" - P3 I2\"),\"\")","v":""},{"$f":"IF(CONCATENATE(C$22,K$3)=Matriz!$J$225,CONCATENATE(Matriz!A225,\" - P3 I2\"),\"\")","v":""},{"$f":"IF(CONCATENATE(C$22,K$3)=Matriz!$J$297,CONCATENATE(Matriz!A297,\" - P3 I2\"),\"\")","v":""},{"$f":"IF(CONCATENATE(C$22,K$3)=Matriz!$J$369,CONCATENATE(Matriz!A369,\" - P3 I2\"),\"\")","v":""},{"$f":"IF(CONCATENATE(C$22,Q$3)=Matriz!$J$9,CONCATENATE(Matriz!A9,\" - P3 I3\"),\"\")","v":""},{"$f":"IF(CONCATENATE(C$22,Q$3)=Matriz!$J$81,CONCATENATE(Matriz!A81,\" - P3 I3\"),\"\")","v":""},{"$f":"IF(CONCATENATE(C$22,Q$3)=Matriz!$J$153,CONCATENATE(Matriz!A153,\" - P3 I3\"),\"\")","v":""},{"$f":"IF(CONCATENATE(C$22,Q$3)=Matriz!$J$225,CONCATENATE(Matriz!A225,\" - P3 I3\"),\"\")","v":""},{"$f":"IF(CONCATENATE(C$22,Q$3)=Matriz!$J$297,CONCATENATE(Matriz!A297,\" - P3 I3\"),\"\")","v":""},{"$f":"IF(CONCATENATE(C$22,Q$3)=Matriz!$J$369,CONCATENATE(Matriz!A369,\" - P3 I3\"),\"\")","v":""},{"$f":"IF(CONCATENATE(C$22,W$3)=Matriz!$J$9,CONCATENATE(Matriz!A9,\" - P3 I4\"),\"\")","v":""},{"$f":"IF(CONCATENATE(C$22,W$3)=Matriz!$J$81,CONCATENATE(Matriz!A81,\" - P3 I4\"),\"\")","v":""},{"$f":"IF(CONCATENATE(C$22,W$3)=Matriz!$J$153,CONCATENATE(Matriz!A153,\" - P3 I4\"),\"\")","v":""},{"$f":"IF(CONCATENATE(C$22,W$3)=Matriz!$J$225,CONCATENATE(Matriz!A225,\" - P3 I4\"),\"\")","v":"R25 - P3 I4"},{"$f":"IF(CONCATENATE(C$22,W$3)=Matriz!$J$297,CONCATENATE(Matriz!A297,\" - P3 I4\"),\"\")","v":"R33 - P3 I4"},{"$f":"IF(CONCATENATE(C$22,W$3)=Matriz!$J$369,CONCATENATE(Matriz!A369,\" - P3 I4\"),\"\")","v":""},{"$f":"IF(CONCATENATE(C$22,AC$3)=Matriz!$J$9,CONCATENATE(Matriz!A9,\" - P3 I5\"),\"\")","v":""},{"$f":"IF(CONCATENATE(C$22,AC$3)=Matriz!$J$81,CONCATENATE(Matriz!A81,\" - P3 I5\"),\"\")","v":""},{"$f":"IF(CONCATENATE(C$22,AC$3)=Matriz!$J$153,CONCATENATE(Matriz!A153,\" - P3 I5\"),\"\")","v":""},{"$f":"IF(CONCATENATE(C$22,AC$3)=Matriz!$J$225,CONCATENATE(Matriz!A225,\" - P3 I5\"),\"\")","v":""},{"$f":"IF(CONCATENATE(C$22,AC$3)=Matriz!$J$297,CONCATENATE(Matriz!A297,\" - P3 I5\"),\"\")","v":""},{"$f":"IF(CONCATENATE(C$22,AC$3)=Matriz!$J$369,CONCATENATE(Matriz!A369,\" - P3 I5\"),\"\")","v":""},{"$nulls":5},9,11,99]
[{"$nulls":4},{"$f":"IF(CONCATENATE(C$22,E$3)=Matriz!$J$18,CONCATENATE(Matriz!A18,\" - P3 I1\"),\"\")","v":""},{"$f":"IF(CONCATENATE(C$22,E$3)=Matriz!$J$90,CONCATENATE(Matriz!A90,\" - P3 I1\"),\"\")","v":""},{"$f":"IF(CONCATENATE(C$22,E$3)=Matriz!$J$162,CONCATENATE(Matriz!A162,\" - P3 I1\"),\"\")","v":""},{"$f":"IF(CONCATENATE(C$22,E$3)=Matriz!$J$234,CONCATENATE(Matriz!A234,\" - P3 I1\"),\"\")","v":""},{"$f":"IF(CONCATENATE(C$22,E$3)=Matriz!$J$306,CONCATENATE(Matriz!A306,\" - P3 I1\"),\"\")","v":""},{"$f":"IF(CONCATENATE(C$22,E$3)=Matriz!$J$378,CONCATENATE(Matriz!A378,\" - P3 I1\"),\"\")","v":""},{"$f":"IF(CONCATENATE(C$22,K$3)=Matriz!$J$18,CONCATENATE(Matriz!A18,\" - P3 I2\"),\"\")","v":""},{"$f":"IF(CONCATENATE(C$22,K$3)=Matriz!$J$90,CONCATENATE(Matriz!A90,\" - P3 I2\"),\"\")","v":""},{"$f":"IF(CONCATENATE(C$22,K$3)=Matriz!$J$162,CONCATENATE(Matriz!A162,\" - P3 I2\"),\"\")","v":""},{"$f":"IF(CONCATENATE(C$22,K$3)=Matriz!$J$234,CONCATENATE(Matriz!A234,\" - P3 I2\"),\"\")","v":""},{"$f":"IF(CONCATENATE(C$22,K$3)=Matriz!$J$306,CONCATENATE(Matriz!A306,\" - P3 I2\"),\"\")","v":""},{"$f":"IF(CONCATENATE(C$22,K$3)=Matriz!$J$378,CONCATENATE(Matriz!A378,\" - P3 I2\"),\"\")","v":""},{"$f":"IF(CONCATENATE(C$22,Q$3)=Matriz!$J$18,CONCATENATE(Matriz!A18,\" - P3 I3\"),\"\")","v":""},{"$f":"IF(CONCATENATE(C$22,Q$3)=Matriz!$J$90,CONCATENATE(Matriz!A90,\" - P3 I3\"),\"\")","v":""},{"$f":"IF(CONCATENATE(C$22,Q$3)=Matriz!$J$162,CONCATENATE(Matriz!A162,\" - P3 I3\"),\"\")","v":""},{"$f":"IF(CONCATENATE(C$22,Q$3)=Matriz!$J$234,CONCATENATE(Matriz!A234,\" - P3 I3\"),\"\")","v":""},{"$f":"IF(CONCATENATE(C$22,Q$3)=Matriz!$J$306,CONCATENATE(Matriz!A306,\" - P3 I3\"),\"\")","v":""},{"$f":"IF(CONCATENATE(C$22,Q$3)=Matriz!$J$378,CONCATENATE(Matriz!A378,\" - P3 I3\"),\"\")","v":""},{"$f":"IF(CONCATENATE(C$22,W$3)=Matriz!$J$18,CONCATENATE(Matriz!A18,\" - P3 I4\"),\"\")","v":""},{"$f":"IF(CONCATENATE(C$22,W$3)=Matriz!$J$90,CONCATENATE(Matriz!A90,\" - P3 I4\"),\"\")","v":"R10 - P3 I4"},{"$f":"IF(CONCATENATE(C$22,W$3)=Matriz!$J$162,CONCATENATE(Matriz!A162,\" - P3 I4\"),\"\")","v":""},{"$f":"IF(CONCATENATE(C$22,W$3)=Matriz!$J$234,CONCATENATE(Matriz!A234,\" - P3 I4\"),\"\")","v":""},{"$f":"IF(CONCATENATE(C$22,W$3)=Matriz!$J$306,CONCATENATE(Matriz!A306,\" - P3 I4\"),\"\")","v":""},{"$f":"IF(CONCATENATE(C$22,W$3)=Matriz!$J$378,CONCATENATE(Matriz!A378,\" - P3 I4\"),\"\")","v":""},{"$f":"IF(CONCATENATE(C$22,AC$3)=Matriz!$J$18,CONCATENATE(Matriz!A18,\" - P3 I5\"),\"\")","v":""},{"$f":"IF(CONCATENATE(C$22,AC$3)=Matriz!$J$90,CONCATENATE(Matriz!A90,\" - P3 I5\"),\"\")","v":""},{"$f":"IF(CONCATENATE(C$22,AC$3)=Matriz!$J$162,CONCATENATE(Matriz!A162,\" - P3 I5\"),\"\")","v":""},{"$f":"IF(CONCATENATE(C$22,AC$3)=Matriz!$J$234,CONCATENATE(Matriz!A234,\" - P3 I5\"),\"\")","v":""},{"$f":"IF(CONCATENATE(C$22,AC$3)=Matriz!$J$306,CONCATENATE(Matriz!A306,\" - P3 I5\"),\"\")","v":""},{"$f":"IF(CONCATENATE(C$22,AC$3)=Matriz!$J$378,CONCATENATE(Matriz!A378,\" - P3 I5\"),\"\")","v":""}]
[{"$nulls":4},{"$f":"IF(CONCATENATE(C$22,E$3)=Matriz!$J$27,CONCATENATE(Matriz!A27,\" - P3 I1\"),\"\")","v":""},{"$f":"IF(CONCATENATE(C$22,E$3)=Matriz!$J$99,CONCATENATE(Matriz!A99,\" - P3 I1\"),\"\")","v":""},{"$f":"IF(CONCATENATE(C$22,E$3)=Matriz!$J$171,CONCATENATE(Matriz!A171,\" - P3 I1\"),\"\")","v":""},{"$f":"IF(CONCATENATE(C$22,E$3)=Matriz!$J$243,CONCATENATE(Matriz!A243,\" - P3 I1\"),\"\")","v":""},{"$f":"IF(CONCATENATE(C$22,E$3)=Matriz!$J$315,CONCATENATE(Matriz!A315,\" - P3 I1\"),\"\")","v":""},{"$f":"IF(CONCATENATE(C$22,E$3)=Matriz!$J$387,CONCATENATE(Matriz!A387,\" - P3 I1\"),\"\")","v":""},{"$f":"IF(CONCATENATE(C$22,K$3)=Matriz!$J$27,CONCATENATE(Matriz!A27,\" - P3 I2\"),\"\")","v":""},{"$f":"IF(CONCATENATE(C$22,K$3)=Matriz!$J$99,CONCATENATE(Matriz!A99,\" - P3 I2\"),\"\")","v":""},{"$f":"IF(CONCATENATE(C$22,K$3)=Matriz!$J$171,CONCATENATE(Matriz!A171,\" - P3 I2\"),\"\")","v":""},{"$f":"IF(CONCATENATE(C$22,K$3)=Matriz!$J$243,CONCATENATE(Matriz!A243,\" - P3 I2\"),\"\")","v":""},{"$f":"IF(CONCATENATE(C$22,K$3)=Matriz!$J$315,CONCATENATE(Matriz!A315,\" - P3 I2\"),\"\")","v":""},{"$f":"IF(CONCATENATE(C$22,K$3)=Matriz!$J$387,CONCATENATE(Matriz!A387,\" - P3 I2\"),\"\")","v":""},{"$f":"IF(CONCATENATE(C$22,Q$3)=Matriz!$J$27,CONCATENATE(Matriz!A27,\" - P3 I3\"),\"\")","v":""},{"$f":"IF(CONCATENATE(C$22,Q$3)=Matriz!$J$99,CONCATENATE(Matriz!A99,\" - P3 I3\"),\"\")","v":""},{"$f":"IF(CONCATENATE(C$22,Q$3)=Matriz!$J$171,CONCATENATE(Matriz!A171,\" - P3 I3\"),\"\")","v":""},{"$f":"IF(CONCATENATE(C$22,Q$3)=Matriz!$J$243,CONCATENATE(Matriz!A243,\" - P3 I3\"),\"\")","v":""},{"$f":"IF(CONCATENATE(C$22,Q$3)=Matriz!$J$315,CONCATENATE(Matriz!A315,\" - P3 I3\"),\"\")","v":""},{"$f":"IF(CONCATENATE(C$22,Q$3)=Matriz!$J$387,CONCATENATE(Matriz!A387,\" - P3 I3\"),\"\")","v":""},{"$f":"IF(CONCATENATE(C$22,W$3)=Matriz!$J$27,CONCATENATE(Matriz!A27,\" - P3 I4\"),\"\")","v":""},{"$f":"IF(CONCATENATE(C$22,W$3)=Matriz!$J$99,CONCATENATE(Matriz!A99,\" - P3 I4\"),\"\")","v":""},{"$f":"IF(CONCATENATE(C$22,W$3)=Matriz!$J$171,CONCATENATE(Matriz!A171,\" - P3 I4\"),\"\")","v":""},{"$f":"IF(CONCATENATE(C$22,W$3)=Matriz!$J$243,CONCATENATE(Matriz!A243,\" - P3 I4\"),\"\")","v":""},{"$f":"IF(CONCATENATE(C$22,W$3)=Matriz!$J$315,CONCATENATE(Matriz!A315,\" - P3 I4\"),\"\")","v":""},{"$f":"IF(CONCATENATE(C$22,W$3)=Matriz!$J$387,CONCATENATE(Matriz!A387,\" - P3 I4\"),\"\")","v":""},{"$f":"IF(CONCATENATE(C$22,AC$3)=Matriz!$J$27,CONCATENATE(Matriz!A27,\" - P3 I5\"),\"\")","v":""},{"$f":"IF(CONCATENATE(C$22,AC$3)=Matriz!$J$99,CONCATENATE(Matriz!A99,\" - P3 I5\"),\"\")","v":""},{"$f":"IF(CONCATENATE(C$22,AC$3)=Matriz!$J$171,CONCATENATE(Matriz!A171,\" - P3 I5\"),\"\")","v":"R19 - P3 I5"},{"$f":"IF(CONCATENATE(C$22,AC$3)=Matriz!$J$243,CONCATENATE(Matriz!A243,\" - P3 I5\"),\"\")","v":""},{"$f":"IF(CONCATENATE(C$22,AC$3)=Matriz!$J$315,CONCATENATE(Matriz!A315,\" - P3 I5\"),\"\")","v":""},{"$f":"IF(CONCATENATE(C$22,AC$3)=Matriz!$J$387,CONCATENATE(Matriz!A387,\" - P3 I5\"),\"\")","v":""}]
[{"$nulls":4},{"$f":"IF(CONCATENATE(C$22,E$3)=Matriz!$J$36,CONCATENATE(Matriz!A36,\" - P3 I1\"),\"\")","v":""},{"$f":"IF(CONCATENATE(C$22,E$3)=Matriz!$J$108,CONCATENATE(Matriz!A108,\" - P3 I1\"),\"\")","v":""},{"$f":"IF(CONCATENATE(C$22,E$3)=Matriz!$J$180,CONCATENATE(Matriz!A180,\" - P3 I1\"),\"\")","v":""},{"$f":"IF(CONCATENATE(C$22,E$3)=Matriz!$J$252,CONCATENATE(Matriz!A252,\" - P3 I1\"),\"\")","v":""},{"$f":"IF(CONCATENATE(C$22,E$3)=Matriz!$J$324,CONCATENATE(Matriz!A324,\" - P3 I1\"),\"\")","v":""},{"$f":"IF(CONCATENATE(C$22,E$3)=Matriz!$J$396,CONCATENATE(Matriz!A396,\" - P3 I1\"),\"\")","v":""},{"$f":"IF(CONCATENATE(C$22,K$3)=Matriz!$J$36,CONCATENATE(Matriz!A36,\" - P3 I2\"),\"\")","v":""},{"$f":"IF(CONCATENATE(C$22,K$3)=Matriz!$J$108,CONCATENATE(Matriz!A108,\" - P3 I2\"),\"\")","v":""},{"$f":"IF(CONCATENATE(C$22,K$3)=Matriz!$J$180,CONCATENATE(Matriz!A180,\" - P3 I2\"),\"\")","v":""},{"$f":"IF(CONCATENATE(C$22,K$3)=Matriz!$J$252,CONCATENATE(Matriz!A252,\" - P3 I2\"),\"\")","v":""},{"$f":"IF(CONCATENATE(C$22,K$3)=Matriz!$J$324,CONCATENATE(Matriz!A324,\" - P3 I2\"),\"\")","v":"R36 - P3 I2"},{"$f":"IF(CONCATENATE(C$22,K$3)=Matriz!$J$396,CONCATENATE(Matriz!A396,\" - P3 I2\"),\"\")","v":""},{"$f":"IF(CONCATENATE(C$22,Q$3)=Matriz!$J$36,CONCATENATE(Matriz!A36,\" - P3 I3\"),\"\")","v":""},{"$f":"IF(CONCATENATE(C$22,Q$3)=Matriz!$J$108,CONCATENATE(Matriz!A108,\" - P3 I3\"),\"\")","v":""},{"$f":"IF(CONCATENATE(C$22,Q$3)=Matriz!$J$180,CONCATENATE(Matriz!A180,\" - P3 I3\"),\"\")","v":""},{"$f":"IF(CONCATENATE(C$22,Q$3)=Matriz!$J$252,CONCATENATE(Matriz!A252,\" - P3 I3\"),\"\")","v":""},{"$f":"IF(CONCATENATE(C$22,Q$3)=Matriz!$J$324,CONCATENATE(Matriz!A324,\" - P3 I3\"),\"\")","v":""},{"$f":"IF(CONCATENATE(C$22,Q$3)=Matriz!$J$396,CONCATENATE(Matriz!A396,\" - P3 I3\"),\"\")","v":""},{"$f":"IF(CONCATENATE(C$22,W$3)=Matriz!$J$36,CONCATENATE(Matriz!A36,\" - P3 I4\"),\"\")","v":""},{"$f":"IF(CONCATENATE(C$22,W$3)=Matriz!$J$108,CONCATENATE(Matriz!A108,\" - P3 I4\"),\"\")","v":""},{"$f":"IF(CONCATENATE(C$22,W$3)=Matriz!$J$180,CONCATENATE(Matriz!A180,\" - P3 I4\"),\"\")","v":""},{"$f":"IF(CONCATENATE(C$22,W$3)=Matriz!$J$252,CONCATENATE(Matriz!A252,\" - P3 I4\"),\"\")","v":"R28 - P3 I4"},{"$f":"IF(CONCATENATE(C$22,W$3)=Matriz!$J$324,CONCATENATE(Matriz!A324,\" - P3 I4\"),\"\")","v":""},{"$f":"IF(CONCATENATE(C$22,W$3)=Matriz!$J$396,CONCATENATE(Matriz!A396,\" - P3 I4\"),\"\")","v":"R44 - P3 I4"},{"$f":"IF(CONCATENATE(C$22,AC$3)=Matriz!$J$36,CONCATENATE(Matriz!A36,\" - P3 I5\"),\"\")","v":""},{"$f":"IF(CONCATENATE(C$22,AC$3)=Matriz!$J$108,CONCATENATE(Matriz!A108,\" - P3 I5\"),\"\")","v":""},{"$f":"IF(CONCATENATE(C$22,AC$3)=Matriz!$J$180,CONCATENATE(Matriz!A180,\" - P3 I5\"),\"\")","v":""},{"$f":"IF(CONCATENATE(C$22,AC$3)=Matriz!$J$252,CONCATENATE(Matriz!A252,\" - P3 I5\"),\"\")","v":""},{"$f":"IF(CONCATENATE(C$22,AC$3)=Matriz!$J$324,CONCATENATE(Matriz!A324,\" - P3 I5\"),\"\")","v":""},{"$f":"IF(CONCATENATE(C$22,AC$3)=Matriz!$J$396,CONCATENATE(Matriz!A396,\" - P3 I5\"),\"\")","v":""}]
[{"$nulls":4},{"$f":"IF(CONCATENATE(C$22,E$3)=Matriz!$J$45,CONCATENATE(Matriz!A45,\" - P3 I1\"),\"\")","v":""},{"$f":"IF(CONCATENATE(C$22,E$3)=Matriz!$J$117,CONCATENATE(Matriz!A117,\" - P3 I1\"),\"\")","v":""},{"$f":"IF(CONCATENATE(C$22,E$3)=Matriz!$J$189,CONCATENATE(Matriz!A189,\" - P3 I1\"),\"\")","v":""},{"$f":"IF(CONCATENATE(C$22,E$3)=Matriz!$J$261,CONCATENATE(Matriz!A261,\" - P3 I1\"),\"\")","v":""},{"$f":"IF(CONCATENATE(C$22,E$3)=Matriz!$J$333,CONCATENATE(Matriz!A333,\" - P3 I1\"),\"\")","v":""},{"$f":"IF(CONCATENATE(C$22,E$3)=Matriz!$J$405,CONCATENATE(Matriz!A405,\" - P3 I1\"),\"\")","v":""},{"$f":"IF(CONCATENATE(C$22,K$3)=Matriz!$J$45,CONCATENATE(Matriz!A45,\" - P3 I2\"),\"\")","v":""},{"$f":"IF(CONCATENATE(C$22,K$3)=Matriz!$J$117,CONCATENATE(Matriz!A117,\" - P3 I2\"),\"\")","v":""},{"$f":"IF(CONCATENATE(C$22,K$3)=Matriz!$J$189,CONCATENATE(Matriz!A189,\" - P3 I2\"),\"\")","v":""},{"$f":"IF(CONCATENATE(C$22,K$3)=Matriz!$J$261,CONCATENATE(Matriz!A261,\" - P3 I2\"),\"\")","v":""},{"$f":"IF(CONCATENATE(C$22,K$3)=Matriz!$J$333,CONCATENATE(Matriz!A333,\" - P3 I2\"),\"\")","v":"R37 - P3 I2"},{"$f":"IF(CONCATENATE(C$22,K$3)=Matriz!$J$405,CONCATENATE(Matriz!A405,\" - P3 I2\"),\"\")","v":""},{"$f":"IF(CONCATENATE(C$22,Q$3)=Matriz!$J$45,CONCATENATE(Matriz!A45,\" - P3 I3\"),\"\")","v":""},{"$f":"IF(CONCATENATE(C$22,Q$3)=Matriz!$J$117,CONCATENATE(Matriz!A117,\" - P3 I3\"),\"\")","v":""},{"$f":"IF(CONCATENATE(C$22,Q$3)=Matriz!$J$189,CONCATENATE(Matriz!A189,\" - P3 I3\"),\"\")","v":""},{"$f":"IF(CONCATENATE(C$22,Q$3)=Matriz!$J$261,CONCATENATE(Matriz!A261,\" - P3 I3\"),\"\")","v":""},{"$f":"IF(CONCATENATE(C$22,Q$3)=Matriz!$J$333,CONCATENATE(Matriz!A333,\" - P3 I3\"),\"\")","v":""},{"$f":"IF(CONCATENATE(C$22,Q$3)=Matriz!$J$405,CONCATENATE(Matriz!A405,\" - P3 I3\"),\"\")","v":""},{"$f":"IF(CONCATENATE(C$22,W$3)=Matriz!$J$45,CONCATENATE(Matriz!A45,\" - P3 I4\"),\"\")","v":""},{"$f":"IF(CONCATENATE(C$22,W$3)=Matriz!$J$117,CONCATENATE(Matriz!A117,\" - P3 I4\"),\"\")","v":""},{"$f":"IF(CONCATENATE(C$22,W$3)=Matriz!$J$189,CONCATENATE(Matriz!A189,\" - P3 I4\"),\"\")","v":""},{"$f":"IF(CONCATENATE(C$22,W$3)=Matriz!$J$261,CONCATENATE(Matriz!A261,\" - P3 I4\"),\"\")","v":""},{"$f":"IF(CONCATENATE(C$22,W$3)=Matriz!$J$333,CONCATENATE(Matriz!A333,\" - P3 I4\"),\"\")","v":""},{"$f":"IF(CONCATENATE(C$22,W$3)=Matriz!$J$405,CONCATENATE(Matriz!A405,\" - P3 I4\"),\"\")","v":""},{"$f":"IF(CONCATENATE(C$22,AC$3)=Matriz!$J$45,CONCATENATE(Matriz!A45,\" - P3 I5\"),\"\")","v":""},{"$f":"IF(CONCATENATE(C$22,AC$3)=Matriz!$J$117,CONCATENATE(Matriz!A117,\" - P3 I5\"),\"\")","v":""},{"$f":"IF(CONCATENATE(C$22,AC$3)=Matriz!$J$189,CONCATENATE(Matriz!A189,\" - P3 I5\"),\"\")","v":""},{"$f":"IF(CONCATENATE(C$22,AC$3)=Matriz!$J$261,CONCATENATE(Matriz!A261,\" - P3 I5\"),\"\")","v":""},{"$f":"IF(CONCATENATE(C$22,AC$3)=Matriz!$J$333,CONCATENATE(Matriz!A333,\" - P3 I5\"),\"\")","v":""},{"$f":"IF(CONCATENATE(C$22,AC$3)=Matriz!$J$405,CONCATENATE(Matriz!A405,\" - P3 I5\"),\"\")","v":""},{"$nulls":5},9,12,108]
[{"$nulls":4},{"$f":"IF(CONCATENATE(C$22,E$3)=Matriz!$J$54,CONCATENATE(Matriz!A54,\" - P3 I1\"),\"\")","v":""},{"$f":"IF(CONCATENATE(C$22,E$3)=Matriz!$J$126,CONCATENATE(Matriz!A126,\" - P3 I1\"),\"\")","v":""},{"$f":"IF(CONCATENATE(C$22,E$3)=Matriz!$J$198,CONCATENATE(Matriz!A198,\" - P3 I1\"),\"\")","v":""},{"$f":"IF(CONCATENATE(C$22,E$3)=Matriz!$J$270,CONCATENATE(Matriz!A270,\" - P3 I1\"),\"\")","v":""},{"$f":"IF(CONCATENATE(C$22,E$3)=Matriz!$J$342,CONCATENATE(Matriz!A342,\" - P3 I1\"),\"\")","v":""},{"$f":"IF(CONCATENATE(C$22,E$3)=Matriz!$J$414,CONCATENATE(Matriz!A414,\" - P3 I1\"),\"\")","v":""},{"$f":"IF(CONCATENATE(C$22,K$3)=Matriz!$J$54,CONCATENATE(Matriz!A54,\" - P3 I2\"),\"\")","v":""},{"$f":"IF(CONCATENATE(C$22,K$3)=Matriz!$J$126,CONCATENATE(Matriz!A126,\" - P3 I2\"),\"\")","v":""},{"$f":"IF(CONCATENATE(C$22,K$3)=Matriz!$J$198,CONCATENATE(Matriz!A198,\" - P3 I2\"),\"\")","v":""},{"$f":"IF(CONCATENATE(C$22,K$3)=Matriz!$J$270,CONCATENATE(Matriz!A270,\" - P3 I2\"),\"\")","v":""},{"$f":"IF(CONCATENATE(C$22,K$3)=Matriz!$J$342,CONCATENATE(Matriz!A342,\" - P3 I2\"),\"\")","v":""},{"$f":"IF(CONCATENATE(C$22,K$3)=Matriz!$J$414,CONCATENATE(Matriz!A414,\" - P3 I2\"),\"\")","v":""},{"$f":"IF(CONCATENATE(C$22,Q$3)=Matriz!$J$54,CONCATENATE(Matriz!A54,\" - P3 I3\"),\"\")","v":""},{"$f":"IF(CONCATENATE(C$22,Q$3)=Matriz!$J$126,CONCATENATE(Matriz!A126,\" - P3 I3\"),\"\")","v":""},{"$f":"IF(CONCATENATE(C$22,Q$3)=Matriz!$J$198,CONCATENATE(Matriz!A198,\" - P3 I3\"),\"\")","v":""},{"$f":"IF(CONCATENATE(C$22,Q$3)=Matriz!$J$270,CONCATENATE(Matriz!A270,\" - P3 I3\"),\"\")","v":""},{"$f":"IF(CONCATENATE(C$22,Q$3)=Matriz!$J$342,CONCATENATE(Matriz!A342,\" - P3 I3\"),\"\")","v":""},{"$f":"IF(CONCATENATE(C$22,Q$3)=Matriz!$J$414,CONCATENATE(Matriz!A414,\" - P3 I3\"),\"\")","v":""},{"$f":"IF(CONCATENATE(C$22,W$3)=Matriz!$J$54,CONCATENATE(Matriz!A54,\" - P3 I4\"),\"\")","v":"R6 - P3 I4"},{"$f":"IF(CONCATENATE(C$22,W$3)=Matriz!$J$126,CONCATENATE(Matriz!A126,\" - P3 I4\"),\"\")","v":""},{"$f":"IF(CONCATENATE(C$22,W$3)=Matriz!$J$198,CONCATENATE(Matriz!A198,\" - P3 I4\"),\"\")","v":""},{"$f":"IF(CONCATENATE(C$22,W$3)=Matriz!$J$270,CONCATENATE(Matriz!A270,\" - P3 I4\"),\"\")","v":"R30 - P3 I4"},{"$f":"IF(CONCATENATE(C$22,W$3)=Matriz!$J$342,CONCATENATE(Matriz!A342,\" - P3 I4\"),\"\")","v":""},{"$f":"IF(CONCATENATE(C$22,W$3)=Matriz!$J$414,CONCATENATE(Matriz!A414,\" - P3 I4\"),\"\")","v":""},{"$f":"IF(CONCATENATE(C$22,AC$3)=Matriz!$J$54,CONCATENATE(Matriz!A54,\" - P3 I5\"),\"\")","v":""},{"$f":"IF(CONCATENATE(C$22,AC$3)=Matriz!$J$126,CONCATENATE(Matriz!A126,\" - P3 I5\"),\"\")","v":""},{"$f":"IF(CONCATENATE(C$22,AC$3)=Matriz!$J$198,CONCATENATE(Matriz!A198,\" - P3 I5\"),\"\")","v":""},{"$f":"IF(CONCATENATE(C$22,AC$3)=Matriz!$J$270,CONCATENATE(Matriz!A270,\" - P3 I5\"),\"\")","v":""},{"$f":"IF(CONCATENATE(C$22,AC$3)=Matriz!$J$342,CONCATENATE(Matriz!A342,\" - P3 I5\"),\"\")","v":""},{"$f":"IF(CONCATENATE(C$22,AC$3)=Matriz!$J$414,CONCATENATE(Matriz!A414,\" - P3 I5\"),\"\")","v":""},{"$nulls":5},9,13,117]
[{"$nulls":4},{"$f":"IF(CONCATENATE(C$22,E$3)=Matriz!$J$63,CONCATENATE(Matriz!A63,\" - P3 I1\"),\"\")","v":""},{"$f":"IF(CONCATENATE(C$22,E$3)=Matriz!$J$135,CONCATENATE(Matriz!A135,\" - P3 I1\"),\"\")","v":""},{"$f":"IF(CONCATENATE(C$22,E$3)=Matriz!$J$207,CONCATENATE(Matriz!A207,\" - P3 I1\"),\"\")","v":""},{"$f":"IF(CONCATENATE(C$22,E$3)=Matriz!$J$279,CONCATENATE(Matriz!A279,\" - P3 I1\"),\"\")","v":""},{"$f":"IF(CONCATENATE(C$22,E$3)=Matriz!$J$351,CONCATENATE(Matriz!A351,\" - P3 I1\"),\"\")","v":""},{"$f":"IF(CONCATENATE(C$22,E$3)=Matriz!$J$423,CONCATENATE(Matriz!A423,\" - P3 I1\"),\"\")","v":""},{"$f":"IF(CONCATENATE(C$22,K$3)=Matriz!$J$63,CONCATENATE(Matriz!A63,\" - P3 I2\"),\"\")","v":""},{"$f":"IF(CONCATENATE(C$22,K$3)=Matriz!$J$135,CONCATENATE(Matriz!A135,\" - P3 I2\"),\"\")","v":""},{"$f":"IF(CONCATENATE(C$22,K$3)=Matriz!$J$207,CONCATENATE(Matriz!A207,\" - P3 I2\"),\"\")","v":""},{"$f":"IF(CONCATENATE(C$22,K$3)=Matriz!$J$279,CONCATENATE(Matriz!A279,\" - P3 I2\"),\"\")","v":""},{"$f":"IF(CONCATENATE(C$22,K$3)=Matriz!$J$351,CONCATENATE(Matriz!A351,\" - P3 I2\"),\"\")","v":""},{"$f":"IF(CONCATENATE(C$22,K$3)=Matriz!$J$423,CONCATENATE(Matriz!A423,\" - P3 I2\"),\"\")","v":""},{"$f":"IF(CONCATENATE(C$22,Q$3)=Matriz!$J$63,CONCATENATE(Matriz!A63,\" - P3 I3\"),\"\")","v":""},{"$f":"IF(CONCATENATE(C$22,Q$3)=Matriz!$J$135,CONCATENATE(Matriz!A135,\" - P3 I3\"),\"\")","v":""},{"$f":"IF(CONCATENATE(C$22,Q$3)=Matriz!$J$207,CONCATENATE(Matriz!A207,\" - P3 I3\"),\"\")","v":""},{"$f":"IF(CONCATENATE(C$22,Q$3)=Matriz!$J$279,CONCATENATE(Matriz!A279,\" - P3 I3\"),\"\")","v":""},{"$f":"IF(CONCATENATE(C$22,Q$3)=Matriz!$J$351,CONCATENATE(Matriz!A351,\" - P3 I3\"),\"\")","v":""},{"$f":"IF(CONCATENATE(C$22,Q$3)=Matriz!$J$423,CONCATENATE(Matriz!A423,\" - P3 I3\"),\"\")","v":""},{"$f":"IF(CONCATENATE(C$22,W$3)=Matriz!$J$63,CONCATENATE(Matriz!A63,\" - P3 I4\"),\"\")","v":"R7 - P3 I4"},{"$f":"IF(CONCATENATE(C$22,W$3)=Matriz!$J$135,CONCATENATE(Matriz!A135,\" - P3 I4\"),\"\")","v":"R15 - P3 I4"},{"$f":"IF(CONCATENATE(C$22,W$3)=Matriz!$J$207,CONCATENATE(Matriz!A207,\" - P3 I4\"),\"\")","v":"R23 - P3 I4"},{"$f":"IF(CONCATENATE(C$22,W$3)=Matriz!$J$279,CONCATENATE(Matriz!A279,\" - P3 I4\"),\"\")","v":""},{"$f":"IF(CONCATENATE(C$22,W$3)=Matriz!$J$351,CONCATENATE(Matriz!A351,\" - P3 I4\"),\"\")","v":""},{"$f":"IF(CONCATENATE(C$22,W$3)=Matriz!$J$423,CONCATENATE(Matriz!A423,\" - P3 I4\"),\"\")","v":""},{"$f":"IF(CONCATENATE(C$22,AC$3)=Matriz!$J$63,CONCATENATE(Matriz!A63,\" - P3 I5\"),\"\")","v":""},{"$f":"IF(CONCATENATE(C$22,AC$3)=Matriz!$J$135,CONCATENATE(Matriz!A135,\" - P3 I5\"),\"\")","v":""},{"$f":"IF(CONCATENATE(C$22,AC$3)=Matriz!$J$207,CONCATENATE(Matriz!A207,\" - P3 I5\"),\"\")","v":""},{"$f":"IF(CONCATENATE(C$22,AC$3)=Matriz!$J$279,CONCATENATE(Matriz!A279,\" - P3 I5\"),\"\")","v":""},{"$f":"IF(CONCATENATE(C$22,AC$3)=Matriz!$J$351,CONCATENATE(Matriz!A351,\" - P3 I5\"),\"\")","v":""},{"$f":"IF(CONCATENATE(C$22,AC$3)=Matriz!$J$423,CONCATENATE(Matriz!A423,\" - P3 I5\"),\"\")","v":""},{"$nulls":5},9,14,126]
[{"$nulls":4},{"$f":"IF(CONCATENATE(C$22,E$3)=Matriz!$J$72,CONCATENATE(Matriz!A72,\" - P3 I1\"),\"\")","v":""},{"$f":"IF(CONCATENATE(C$22,E$3)=Matriz!$J$144,CONCATENATE(Matriz!A144,\" - P3 I1\"),\"\")","v":""},{"$f":"IF(CONCATENATE(C$22,E$3)=Matriz!$J$216,CONCATENATE(Matriz!A216,\" - P3 I1\"),\"\")","v":""},{"$f":"IF(CONCATENATE(C$22,E$3)=Matriz!$J$288,CONCATENATE(Matriz!A288,\" - P3 I1\"),\"\")","v":""},{"$f":"IF(CONCATENATE(C$22,E$3)=Matriz!$J$360,CONCATENATE(Matriz!A360,\" - P3 I1\"),\"\")","v":""},{"$f":"IF(CONCATENATE(C$22,E$3)=Matriz!$J$432,CONCATENATE(Matriz!A432,\" - P3 I1\"),\"\")","v":""},{"$f":"IF(CONCATENATE(C$22,K$3)=Matriz!$J$72,CONCATENATE(Matriz!A72,\" - P3 I2\"),\"\")","v":""},{"$f":"IF(CONCATENATE(C$22,K$3)=Matriz!$J$144,CONCATENATE(Matriz!A144,\" - P3 I2\"),\"\")","v":""},{"$f":"IF(CONCATENATE(C$22,K$3)=Matriz!$J$216,CONCATENATE(Matriz!A216,\" - P3 I2\"),\"\")","v":""},{"$f":"IF(CONCATENATE(C$22,K$3)=Matriz!$J$288,CONCATENATE(Matriz!A288,\" - P3 I2\"),\"\")","v":""},{"$f":"IF(CONCATENATE(C$22,K$3)=Matriz!$J$360,CONCATENATE(Matriz!A360,\" - P3 I2\"),\"\")","v":""},{"$f":"IF(CONCATENATE(C$22,K$3)=Matriz!$J$432,CONCATENATE(Matriz!A432,\" - P3 I2\"),\"\")","v":""},{"$f":"IF(CONCATENATE(C$22,Q$3)=Matriz!$J$72,CONCATENATE(Matriz!A72,\" - P3 I3\"),\"\")","v":""},{"$f":"IF(CONCATENATE(C$22,Q$3)=Matriz!$J$144,CONCATENATE(Matriz!A144,\" - P3 I3\"),\"\")","v":""},{"$f":"IF(CONCATENATE(C$22,Q$3)=Matriz!$J$216,CONCATENATE(Matriz!A216,\" - P3 I3\"),\"\")","v":""},{"$f":"IF(CONCATENATE(C$22,Q$3)=Matriz!$J$288,CONCATENATE(Matriz!A288,\" - P3 I3\"),\"\")","v":""},{"$f":"IF(CONCATENATE(C$22,Q$3)=Matriz!$J$360,CONCATENATE(Matriz!A360,\" - P3 I3\"),\"\")","v":""},{"$f":"IF(CONCATENATE(C$22,Q$3)=Matriz!$J$4324,CONCATENATE(Matriz!A432,\" - P3 I3\"),\"\")","v":""},{"$f":"IF(CONCATENATE(C$22,W$3)=Matriz!$J$72,CONCATENATE(Matriz!A72,\" - P3 I4\"),\"\")","v":""},{"$f":"IF(CONCATENATE(C$22,W$3)=Matriz!$J$144,CONCATENATE(Matriz!A144,\" - P3 I4\"),\"\")","v":"R16 - P3 I4"},{"$f":"IF(CONCATENATE(C$22,W$3)=Matriz!$J$216,CONCATENATE(Matriz!A216,\" - P3 I4\"),\"\")","v":""},{"$f":"IF(CONCATENATE(C$22,W$3)=Matriz!$J$288,CONCATENATE(Matriz!A288,\" - P3 I4\"),\"\")","v":""},{"$f":"IF(CONCATENATE(C$22,W$3)=Matriz!$J$360,CONCATENATE(Matriz!A360,\" - P3 I4\"),\"\")","v":""},{"$f":"IF(CONCATENATE(C$22,W$3)=Matriz!$J$432,CONCATENATE(Matriz!A432,\" - P3 I4\"),\"\")","v":""},{"$f":"IF(CONCATENATE(C$22,AC$3)=Matriz!$J$72,CONCATENATE(Matriz!A72,\" - P3 I5\"),\"\")","v":""},{"$f":"IF(CONCATENATE(C$22,AC$3)=Matriz!$J$144,CONCATENATE(Matriz!A144,\" - P3 I5\"),\"\")","v":""},{"$f":"IF(CONCATENATE(C$22,AC$3)=Matriz!$J$216,CONCATENATE(Matriz!A216,\" - P3 I5\"),\"\")","v":"R24 - P3 I5"},{"$f":"IF(CONCATENATE(C$22,AC$3)=Matriz!$J$288,CONCATENATE(Matriz!A288,\" - P3 I5\"),\"\")","v":""},{"$f":"IF(CONCATENATE(C$22,AC$3)=Matriz!$J$360,CONCATENATE(Matriz!A360,\" - P3 I5\"),\"\")","v":""},{"$f":"IF(CONCATENATE(C$22,AC$3)=Matriz!$J$432,CONCATENATE(Matriz!A432,\" - P3 I5\"),\"\")","v":""}]
[null,null,4,"PROBABLE",{"$f":"IF(CONCATENATE(C$30,E$3)=Matriz!$J$9,CONCATENATE(Matriz!A9,\" - P4 I1\"),\"\")","v":""},{"$f":"IF(CONCATENATE(C$30,E$3)=Matriz!$J$81,CONCATENATE(Matriz!A81,\" - P4 I1\"),\"\")","v":""},{"$f":"IF(CONCATENATE(C$30,E$3)=Matriz!$J$153,CONCATENATE(Matriz!A153,\" - P4 I1\"),\"\")","v":""},{"$f":"IF(CONCATENATE(C$30,E$3)=Matriz!$J$225,CONCATENATE(Matriz!A225,\" - P4 I1\"),\"\")","v":""},{"$f":"IF(CONCATENATE(C$30,E$3)=Matriz!$J$297,CONCATENATE(Matriz!A297,\" - P4 I1\"),\"\")","v":""},{"$f":"IF(CONCATENATE(C$30,E$3)=Matriz!$J$369,CONCATENATE(Matriz!A369,\" - P4 I1\"),\"\")","v":""},{"$f":"IF(CONCATENATE(C$30,K$3)=Matriz!$J$9,CONCATENATE(Matriz!A9,\" - P4 I2\"),\"\")","v":""},{"$f":"IF(CONCATENATE(C$30,K$3)=Matriz!$J$81,CONCATENATE(Matriz!A81,\" - P4 I2\"),\"\")","v":""},{"$f":"IF(CONCATENATE(C$30,K$3)=Matriz!$J$153,CONCATENATE(Matriz!A153,\" - P4 I2\"),\"\")","v":""},{"$f":"IF(CONCATENATE(C$30,K$3)=Matriz!$J$225,CONCATENATE(Matriz!A225,\" - P4 I2\"),\"\")","v":""},{"$f":"IF(CONCATENATE(C$30,K$3)=Matriz!$J$297,CONCATENATE(Matriz!A297,\" - P4 I2\"),\"\")","v":""},{"$f":"IF(CONCATENATE(C$30,K$3)=Matriz!$J$369,CONCATENATE(Matriz!A369,\" - P4 I2\"),\"\")","v":""},{"$f":"IF(CONCATENATE(C$30,Q$3)=Matriz!$J$9,CONCATENATE(Matriz!A9,\" - P4 I3\"),\"\")","v":""},{"$f":"IF(CONCATENATE(C$30,Q$3)=Matriz!$J$81,CONCATENATE(Matriz!A81,\" - P4 I3\"),\"\")","v":""},{"$f":"IF(CONCATENATE(C$30,Q$3)=Matriz!$J$153,CONCATENATE(Matriz!A153,\" - P4 I3\"),\"\")","v":""},{"$f":"IF(CONCATENATE(C$30,Q$3)=Matriz!$J$225,CONCATENATE(Matriz!A225,\" - P4 I3\"),\"\")","v":""},{"$f":"IF(CONCATENATE(C$30,Q$3)=Matriz!$J$297,CONCATENATE(Matriz!A297,\" - P4 I3\"),\"\")","v":""},{"$f":"IF(CONCATENATE(C$30,Q$3)=Matriz!$J$369,CONCATENATE(Matriz!A369,\" - P4 I3\"),\"\")","v":""},{"$f":"IF(CONCATENATE(C$30,W$3)=Matriz!$J$9,CONCATENATE(Matriz!A9,\" - P4 I4\"),\"\")","v":""},{"$f":"IF(CONCATENATE(C$30,W$3)=Matriz!$J$81,CONCATENATE(Matriz!A81,\" - P4 I4\"),\"\")","v":"R9 - P4 I4"},{"$f":"IF(CONCATENATE(C$30,W$3)=Matriz!$J$153,CONCATENATE(Matriz!A153,\" - P4 I4\"),\"\")","v":""},{"$f":"IF(CONCATENATE(C$30,W$3)=Matriz!$J$225,CONCATENATE(Matriz!A225,\" - P4 I4\"),\"\")","v":""},{"$f":"IF(CONCATENATE(C$30,W$3)=Matriz!$J$297,CONCATENATE(Matriz!A297,\" - P4 I4\"),\"\")","v":""},{"$f":"IF(CONCATENATE(C$30,W$3)=Matriz!$J$369,CONCATENATE(Matriz!A369,\" - P4 I4\"),\"\")","v":""},{"$f":"IF(CONCATENATE(C$30,AC$3)=Matriz!$J$9,CONCATENATE(Matriz!A9,\" - P4 I5\"),\"\")","v":""},{"$f":"IF(CONCATENATE(C$30,AC$3)=Matriz!$J$81,CONCATENATE(Matriz!A81,\" - P4 I5\"),\"\")","v":""},{"$f":"IF(CONCATENATE(C$30,AC$3)=Matriz!$J$153,CONCATENATE(Matriz!A153,\" - P4 I5\"),\"\")","v":""},{"$f":"IF(CONCATENATE(C$30,AC$3)=Matriz!$J$225,CONCATENATE(Matriz!A225,\" - P4 I5\"),\"\")","v":""},{"$f":"IF(CONCATENATE(C$30,AC$3)=Matriz!$J$297,CONCATENATE(Matriz!A297,\" - P4 I5\"),\"\")","v":""},{"$f":"IF(CONCATENATE(C$30,AC$3)=Matriz!$J$369,CONCATENATE(Matriz!A369,\" - P4 I5\"),\"\")","v":""}]
[{"$nulls":4},{"$f":"IF(CONCATENATE(C$30,E$3)=Matriz!$J$18,CONCATENATE(Matriz!A18,\" - P4 I1\"),\"\")","v":""},{"$f":"IF(CONCATENATE(C$30,E$3)=Matriz!$J$90,CONCATENATE(Matriz!A90,\" - P4 I1\"),\"\")","v":""},{"$f":"IF(CONCATENATE(C$30,E$3)=Matriz!$J$162,CONCATENATE(Matriz!A162,\" - P4 I1\"),\"\")","v":""},{"$f":"IF(CONCATENATE(C$30,E$3)=Matriz!$J$234,CONCATENATE(Matriz!A234,\" - P4 I1\"),\"\")","v":""},{"$f":"IF(CONCATENATE(C$30,E$3)=Matriz!$J$306,CONCATENATE(Matriz!A306,\" - P4 I1\"),\"\")","v":""},{"$f":"IF(CONCATENATE(C$30,E$3)=Matriz!$J$378,CONCATENATE(Matriz!A378,\" - P4 I1\"),\"\")","v":""},{"$f":"IF(CONCATENATE(C$30,K$3)=Matriz!$J$18,CONCATENATE(Matriz!A18,\" - P4 I2\"),\"\")","v":""},{"$f":"IF(CONCATENATE(C$30,K$3)=Matriz!$J$90,CONCATENATE(Matriz!A90,\" - P4 I2\"),\"\")","v":""},{"$f":"IF(CONCATENATE(C$30,K$3)=Matriz!$J$162,CONCATENATE(Matriz!A162,\" - P4 I2\"),\"\")","v":""},{"$f":"IF(CONCATENATE(C$30,K$3)=Matriz!$J$234,CONCATENATE(Matriz!A234,\" - P4 I2\"),\"\")","v":""},{"$f":"IF(CONCATENATE(C$30,K$3)=Matriz!$J$306,CONCATENATE(Matriz!A306,\" - P4 I2\"),\"\")","v":""},{"$f":"IF(CONCATENATE(C$30,K$3)=Matriz!$J$378,CONCATENATE(Matriz!A378,\" - P4 I2\"),\"\")","v":""},{"$f":"IF(CONCATENATE(C$30,Q$3)=Matriz!$J$18,CONCATENATE(Matriz!A18,\" - P4 I3\"),\"\")","v":""},{"$f":"IF(CONCATENATE(C$30,Q$3)=Matriz!$J$90,CONCATENATE(Matriz!A90,\" - P4 I3\"),\"\")","v":""},{"$f":"IF(CONCATENATE(C$30,Q$3)=Matriz!$J$162,CONCATENATE(Matriz!A162,\" - P4 I3\"),\"\")","v":"R18 - P4 I3"},{"$f":"IF(CONCATENATE(C$30,Q$3)=Matriz!$J$234,CONCATENATE(Matriz!A234,\" - P4 I3\"),\"\")","v":""},{"$f":"IF(CONCATENATE(C$30,Q$3)=Matriz!$J$306,CONCATENATE(Matriz!A306,\" - P4 I3\"),\"\")","v":""},{"$f":"IF(CONCATENATE(C$30,Q$3)=Matriz!$J$378,CONCATENATE(Matriz!A378,\" - P4 I3\"),\"\")","v":""},{"$f":"IF(CONCATENATE(C$30,W$3)=Matriz!$J$18,CONCATENATE(Matriz!A18,\" - P4 I4\"),\"\")","v":""},{"$f":"IF(CONCATENATE(C$30,W$3)=Matriz!$J$90,CONCATENATE(Matriz!A90,\" - P4 I4\"),\"\")","v":""},{"$f":"IF(CONCATENATE(C$30,W$3)=Matriz!$J$162,CONCATENATE(Matriz!A162,\" - P4 I4\"),\"\")","v":""},{"$f":"IF(CONCATENATE(C$30,W$3)=Matriz!$J$234,CONCATENATE(Matriz!A234,\" - P4 I4\"),\"\")","v":""},{"$f":"IF(CONCATENATE(C$30,W$3)=Matriz!$J$306,CONCATENATE(Matriz!A306,\" - P4 I4\"),\"\")","v":"R34 - P4 I4"},{"$f":"IF(CONCATENATE(C$30,W$3)=Matriz!$J$378,CONCATENATE(Matriz!A378,\" - P4 I4\"),\"\")","v":""},{"$f":"IF(CONCATENATE(C$30,AC$3)=Matriz!$J$18,CONCATENATE(Matriz!A18,\" - P4 I5\"),\"\")","v":"R2 - P4 I5"},{"$f":"IF(CONCATENATE(C$30,AC$3)=Matriz!$J$90,CONCATENATE(Matriz!A90,\" - P4 I5\"),\"\")","v":""},{"$f":"IF(CONCATENATE(C$30,AC$3)=Matriz!$J$162,CONCATENATE(Matriz!A162,\" - P4 I5\"),\"\")","v":""},{"$f":"IF(CONCATENATE(C$30,AC$3)=Matriz!$J$234,CONCATENATE(Matriz!A234,\" - P4 I5\"),\"\")","v":""},{"$f":"IF(CONCATENATE(C$30,AC$3)=Matriz!$J$306,CONCATENATE(Matriz!A306,\" - P4 I5\"),\"\")","v":""},{"$f":"IF(CONCATENATE(C$30,AC$3)=Matriz!$J$378,CONCATENATE(Matriz!A378,\" - P4 I5\"),\"\")","v":""}]
[{"$nulls":4},{"$f":"IF(CONCATENATE(C$30,E$3)=Matriz!$J$27,CONCATENATE(Matriz!A27,\" - P4 I1\"),\"\")","v":""},{"$f":"IF(CONCATENATE(C$30,E$3)=Matriz!$J$99,CONCATENATE(Matriz!A99,\" - P4 I1\"),\"\")","v":""},{"$f":"IF(CONCATENATE(C$30,E$3)=Matriz!$J$171,CONCATENATE(Matriz!A171,\" - P4 I1\"),\"\")","v":""},{"$f":"IF(CONCATENATE(C$30,E$3)=Matriz!$J$243,CONCATENATE(Matriz!A243,\" - P4 I1\"),\"\")","v":""},{"$f":"IF(CONCATENATE(C$30,E$3)=Matriz!$J$315,CONCATENATE(Matriz!A315,\" - P4 I1\"),\"\")","v":""},{"$f":"IF(CONCATENATE(C$30,E$3)=Matriz!$J$387,CONCATENATE(Matriz!A387,\" - P4 I1\"),\"\")","v":""},{"$f":"IF(CONCATENATE(C$30,K$3)=Matriz!$J$27,CONCATENATE(Matriz!A27,\" - P4 I2\"),\"\")","v":""},{"$f":"IF(CONCATENATE(C$30,K$3)=Matriz!$J$99,CONCATENATE(Matriz!A99,\" - P4 I2\"),\"\")","v":""},{"$f":"IF(CONCATENATE(C$30,K$3)=Matriz!$J$171,CONCATENATE(Matriz!A171,\" - P4 I2\"),\"\")","v":""},{"$f":"IF(CONCATENATE(C$30,K$3)=Matriz!$J$243,CONCATENATE(Matriz!A243,\" - P4 I2\"),\"\")","v":""},{"$f":"IF(CONCATENATE(C$30,K$3)=Matriz!$J$315,CONCATENATE(Matriz!A315,\" - P4 I2\"),\"\")","v":""},{"$f":"IF(CONCATENATE(C$30,K$3)=Matriz!$J$387,CONCATENATE(Matriz!A387,\" - P4 I2\"),\"\")","v":""},{"$f":"IF(CONCATENATE(C$30,Q$3)=Matriz!$J$27,CONCATENATE(Matriz!A27,\" - P4 I3\"),\"\")","v":""},{"$f":"IF(CONCATENATE(C$30,Q$3)=Matriz!$J$99,CONCATENATE(Matriz!A99,\" - P4 I3\"),\"\")","v":""},{"$f":"IF(CONCATENATE(C$30,Q$3)=Matriz!$J$171,CONCATENATE(Matriz!A171,\" - P4 I3\"),\"\")","v":""},{"$f":"IF(CONCATENATE(C$30,Q$3)=Matriz!$J$243,CONCATENATE(Matriz!A243,\" - P4 I3\"),\"\")","v":""},{"$f":"IF(CONCATENATE(C$30,Q$3)=Matriz!$J$315,CONCATENATE(Matriz!A315,\" - P4 I3\"),\"\")","v":""},{"$f":"IF(CONCATENATE(C$30,Q$3)=Matriz!$J$387,CONCATENATE(Matriz!A387,\" - P4 I3\"),\"\")","v":""},{"$f":"IF(CONCATENATE(C$30,W$3)=Matriz!$J$27,CONCATENATE(Matriz!A27,\" - P4 I4\"),\"\")","v":""},{"$f":"IF(CONCATENATE(C$30,W$3)=Matriz!$J$99,CONCATENATE(Matriz!A99,\" - P4 I4\"),\"\")","v":"R11 - P4 I4"},{"$f":"IF(CONCATENATE(C$30,W$3)=Matriz!$J$171,CONCATENATE(Matriz!A171,\" - P4 I4\"),\"\")","v":""},{"$f":"IF(CONCATENATE(C$30,W$3)=Matriz!$J$243,CONCATENATE(Matriz!A243,\" - P4 I4\"),\"\")","v":""},{"$f":"IF(CONCATENATE(C$30,W$3)=Matriz!$J$315,CONCATENATE(Matriz!A315,\" - P4 I4\"),\"\")","v":"R35 - P4 I4"},{"$f":"IF(CONCATENATE(C$30,W$3)=Matriz!$J$387,CONCATENATE(Matriz!A387,\" - P4 I4\"),\"\")","v":""},{"$f":"IF(CONCATENATE(C$30,AC$3)=Matriz!$J$27,CONCATENATE(Matriz!A27,\" - P4 I5\"),\"\")","v":""},{"$f":"IF(CONCATENATE(C$30,AC$3)=Matriz!$J$99,CONCATENATE(Matriz!A99,\" - P4 I5\"),\"\")","v":""},{"$f":"IF(CONCATENATE(C$30,AC$3)=Matriz!$J$171,CONCATENATE(Matriz!A171,\" - P4 I5\"),\"\")","v":""},{"$f":"IF(CONCATENATE(C$30,AC$3)=Matriz!$J$243,CONCATENATE(Matriz!A243,\" - P4 I5\"),\"\")","v":""},{"$f":"IF(CONCATENATE(C$30,AC$3)=Matriz!$J$315,CONCATENATE(Matriz!A315,\" - P4 I5\"),\"\")","v":""},{"$f":"IF(CONCATENATE(C$30,AC$3)=Matriz!$J$378,CONCATENATE(Matriz!A378,\" - P4 I5\"),\"\")","v":""}]
[{"$nulls":4},{"$f":"IF(CONCATENATE(C$30,E$3)=Matriz!$J$36,CONCATENATE(Matriz!A36,\" - P4 I1\"),\"\")","v":""},{"$f":"IF(CONCATENATE(C$30,E$3)=Matriz!$J$108,CONCATENATE(Matriz!A108,\" - P4 I1\"),\"\")","v":""},{"$f":"IF(CONCATENATE(C$30,E$3)=Matriz!$J$180,CONCATENATE(Matriz!A180,\" - P4 I1\"),\"\")","v":""},{"$f":"IF(CONCATENATE(C$30,E$3)=Matriz!$J$252,CONCATENATE(Matriz!A252,\" - P4 I1\"),\"\")","v":""},{"$f":"IF(CONCATENATE(C$30,E$3)=Matriz!$J$324,CONCATENATE(Matriz!A324,\" - P4 I1\"),\"\")","v":""},{"$f":"IF(CONCATENATE(C$30,E$3)=Matriz!$J$396,CONCATENATE(Matriz!A396,\" - P4 I1\"),\"\")","v":""},{"$f":"IF(CONCATENATE(C$30,K$3)=Matriz!$J$36,CONCATENATE(Matriz!A36,\" - P4 I2\"),\"\")","v":""},{"$f":"IF(CONCATENATE(C$30,K$3)=Matriz!$J$108,CONCATENATE(Matriz!A108,\" - P4 I2\"),\"\")","v":""},{"$f":"IF(CONCATENATE(C$30,K$3)=Matriz!$J$180,CONCATENATE(Matriz!A180,\" - P4 I2\"),\"\")","v":""},{"$f":"IF(CONCATENATE(C$30,K$3)=Matriz!$J$252,CONCATENATE(Matriz!A252,\" - P4 I2\"),\"\")","v":""},{"$f":"IF(CONCATENATE(C$30,K$3)=Matriz!$J$324,CONCATENATE(Matriz!A324,\" - P4 I2\"),\"\")","v":""},{"$f":"IF(CONCATENATE(C$30,K$3)=Matriz!$J$396,CONCATENATE(Matriz!A396,\" - P4 I2\"),\"\")","v":""},{"$f":"IF(CONCATENATE(C$30,Q$3)=Matriz!$J$36,CONCATENATE(Matriz!A36,\" - P4 I3\"),\"\")","v":""},{"$f":"IF(CONCATENATE(C$30,Q$3)=Matriz!$J$108,CONCATENATE(Matriz!A108,\" - P4 I3\"),\"\")","v":""},{"$f":"IF(CONCATENATE(C$30,Q$3)=Matriz!$J$180,CONCATENATE(Matriz!A180,\" - P4 I3\"),\"\")","v":""},{"$f":"IF(CONCATENATE(C$30,Q$3)=Matriz!$J$252,CONCATENATE(Matriz!A252,\" - P4 I3\"),\"\")","v":""},{"$f":"IF(CONCATENATE(C$30,Q$3)=Matriz!$J$324,CONCATENATE(Matriz!A324,\" - P4 I3\"),\"\")","v":""},{"$f":"IF(CONCATENATE(C$30,Q$3)=Matriz!$J$396,CONCATENATE(Matriz!A396,\" - P4 I3\"),\"\")","v":""},{"$f":"IF(CONCATENATE(C$30,W$3)=Matriz!$J$36,CONCATENATE(Matriz!A36,\" - P4 I4\"),\"\")","v":""},{"$f":"IF(CONCATENATE(C$30,W$3)=Matriz!$J$108,CONCATENATE(Matriz!A108,\" - P4 I4\"),\"\")","v":"R12 - P4 I4"},{"$f":"IF(CONCATENATE(C$30,W$3)=Matriz!$J$180,CONCATENATE(Matriz!A180,\" - P4 I4\"),\"\")","v":""},{"$f":"IF(CONCATENATE(C$30,W$3)=Matriz!$J$252,CONCATENATE(Matriz!A252,\" - P4 I4\"),\"\")","v":""},{"$f":"IF(CONCATENATE(C$30,W$3)=Matriz!$J$324,CONCATENATE(Matriz!A324,\" - P4 I4\"),\"\")","v":""},{"$f":"IF(CONCATENATE(C$30,W$3)=Matriz!$J$396,CONCATENATE(Matriz!A396,\" - P4 I4\"),\"\")","v":""},{"$f":"IF(CONCATENATE(C$30,AC$3)=Matriz!$J$36,CONCATENATE(Matriz!A36,\" - P4 I5\"),\"\")","v":"R4 - P4 I5"},{"$f":"IF(CONCATENATE(C$30,AC$3)=Matriz!$J$108,CONCATENATE(Matriz!A108,\" - P4 I5\"),\"\")","v":""},{"$f":"IF(CONCATENATE(C$30,AC$3)=Matriz!$J$180,CONCATENATE(Matriz!A180,\" - P4 I5\"),\"\")","v":""},{"$f":"IF(CONCATENATE(C$30,AC$3)=Matriz!$J$252,CONCATENATE(Matriz!A252,\" - P4 I5\"),\"\")","v":""},{"$f":"IF(CONCATENATE(C$30,AC$3)=Matriz!$J$324,CONCATENATE(Matriz!A324,\" - P4 I5\"),\"\")","v":""},{"$f":"IF(CONCATENATE(C$30,AC$3)=Matriz!$J$396,CONCATENATE(Matriz!A396,\" - P4 I5\"),\"\")","v":""}]
[{"$nulls":4},{"$f":"IF(CONCATENATE(C$30,E$3)=Matriz!$J$45,CONCATENATE(Matriz!A45,\" - P4 I1\"),\"\")","v":""},{"$f":"IF(CONCATENATE(C$30,E$3)=Matriz!$J$117,CONCATENATE(Matriz!A117,\" - P4 I1\"),\"\")","v":""},{"$f":"IF(CONCATENATE(C$30,E$3)=Matriz!$J$189,CONCATENATE(Matriz!A189,\" - P4 I1\"),\"\")","v":""},{"$f":"IF(CONCATENATE(C$30,E$3)=Matriz!$J$261,CONCATENATE(Matriz!A261,\" - P4 I1\"),\"\")","v":""},{"$f":"IF(CONCATENATE(C$30,E$3)=Matriz!$J$333,CONCATENATE(Matriz!A333,\" - P4 I1\"),\"\")","v":""},{"$f":"IF(CONCATENATE(C$30,E$3)=Matriz!$J$405,CONCATENATE(Matriz!A405,\" - P4 I1\"),\"\")","v":""},{"$f":"IF(CONCATENATE(C$30,K$3)=Matriz!$J$45,CONCATENATE(Matriz!A45,\" - P4 I2\"),\"\")","v":""},{"$f":"IF(CONCATENATE(C$30,K$3)=Matriz!$J$117,CONCATENATE(Matriz!A117,\" - P4 I2\"),\"\")","v":""},{"$f":"IF(CONCATENATE(C$30,K$3)=Matriz!$J$189,CONCATENATE(Matriz!A189,\" - P4 I2\"),\"\")","v":""},{"$f":"IF(CONCATENATE(C$30,K$3)=Matriz!$J$261,CONCATENATE(Matriz!A261,\" - P4 I2\"),\"\")","v":""},{"$f":"IF(CONCATENATE(C$30,K$3)=Matriz!$J$333,CONCATENATE(Matriz!A333,\" - P4 I2\"),\"\")","v":""},{"$f":"IF(CONCATENATE(C$30,K$3)=Matriz!$J$405,CONCATENATE(Matriz!A405,\" - P4 I2\"),\"\")","v":""},{"$f":"IF(CONCATENATE(C$30,Q$3)=Matriz!$J$45,CONCATENATE(Matriz!A45,\" - P4 I3\"),\"\")","v":""},{"$f":"IF(CONCATENATE(C$30,Q$3)=Matriz!$J$117,CONCATENATE(Matriz!A117,\" - P4 I3\"),\"\")","v":""},{"$f":"IF(CONCATENATE(C$30,Q$3)=Matriz!$J$189,CONCATENATE(Matriz!A189,\" - P4 I3\"),\"\")","v":""},{"$f":"IF(CONCATENATE(C$30,Q$3)=Matriz!$J$261,CONCATENATE(Matriz!A261,\" - P4 I3\"),\"\")","v":""},{"$f":"IF(CONCATENATE(C$30,Q$3)=Matriz!$J$333,CONCATENATE(Matriz!A333,\" - P4 I3\"),\"\")","v":""},{"$f":"IF(CONCATENATE(C$30,Q$3)=Matriz!$J$405,CONCATENATE(Matriz!A405,\" - P4 I3\"),\"\")","v":""},{"$f":"IF(CONCATENATE(C$30,W$3)=Matriz!$J$45,CONCATENATE(Matriz!A45,\" - P4 I4\"),\"\")","v":""},{"$f":"IF(CONCATENATE(C$30,W$3)=Matriz!$J$117,CONCATENATE(Matriz!A117,\" - P4 I4\"),\"\")","v":"R13 - P4 I4"},{"$f":"IF(CONCATENATE(C$30,W$3)=Matriz!$J$189,CONCATENATE(Matriz!A189,\" - P4 I4\"),\"\")","v":""},{"$f":"IF(CONCATENATE(C$30,W$3)=Matriz!$J$261,CONCATENATE(Matriz!A261,\" - P4 I4\"),\"\")","v":""},{"$f":"IF(CONCATENATE(C$30,W$3)=Matriz!$J$333,CONCATENATE(Matriz!A333,\" - P4 I4\"),\"\")","v":""},{"$f":"IF(CONCATENATE(C$30,W$3)=Matriz!$J$405,CONCATENATE(Matriz!A405,\" - P4 I4\"),\"\")","v":""},{"$f":"IF(CONCATENATE(C$30,AC$3)=Matriz!$J$45,CONCATENATE(Matriz!A45,\" - P4 I5\"),\"\")","v":""},{"$f":"IF(CONCATENATE(C$30,AC$3)=Matriz!$J$117,CONCATENATE(Matriz!A117,\" - P4 I5\"),\"\")","v":""},{"$f":"IF(CONCATENATE(C$30,AC$3)=Matriz!$J$189,CONCATENATE(Matriz!A189,\" - P4 I5\"),\"\")","v":""},{"$f":"IF(CONCATENATE(C$30,AC$3)=Matriz!$J$261,CONCATENATE(Matriz!A261,\" - P4 I5\"),\"\")","v":""},{"$f":"IF(CONCATENATE(C$30,AC$3)=Matriz!$J$333,CONCATENATE(Matriz!A333,\" - P4 I5\"),\"\")","v":""},{"$f":"IF(CONCATENATE(C$30,AC$3)=Matriz!$J$405,CONCATENATE(Matriz!A405,\" - P4 I5\"),\"\")","v":""}]
[{"$nulls":4},{"$f":"IF(CONCATENATE(C$30,E$3)=Matriz!$J$54,CONCATENATE(Matriz!A54,\" - P4 I1\"),\"\")","v":""},{"$f":"IF(CONCATENATE(C$30,E$3)=Matriz!$J$126,CONCATENATE(Matriz!A126,\" - P4 I1\"),\"\")","v":""},{"$f":"IF(CONCATENATE(C$30,E$3)=Matriz!$J$198,CONCATENATE(Matriz!A198,\" - P4 I1\"),\"\")","v":""},{"$f":"IF(CONCATENATE(C$30,E$3)=Matriz!$J$270,CONCATENATE(Matriz!A270,\" - P4 I1\"),\"\")","v":""},{"$f":"IF(CONCATENATE(C$30,E$3)=Matriz!$J$342,CONCATENATE(Matriz!A342,\" - P4 I1\"),\"\")","v":""},{"$f":"IF(CONCATENATE(C$30,E$3)=Matriz!$J$414,CONCATENATE(Matriz!A414,\" - P4 I1\"),\"\")","v":""},{"$f":"IF(CONCATENATE(C$30,K$3)=Matriz!$J$54,CONCATENATE(Matriz!A54,\" - P4 I2\"),\"\")","v":""},{"$f":"IF(CONCATENATE(C$30,K$3)=Matriz!$J$126,CONCATENATE(Matriz!A126,\" - P4 I2\"),\"\")","v":""},{"$f":"IF(CONCATENATE(C$30,K$3)=Matriz!$J$198,CONCATENATE(Matriz!A198,\" - P4 I2\"),\"\")","v":""},{"$f":"IF(CONCATENATE(C$30,K$3)=Matriz!$J$270,CONCATENATE(Matriz!A270,\" - P4 I2\"),\"\")","v":""},{"$f":"IF(CONCATENATE(C$30,K$3)=Matriz!$J$342,CONCATENATE(Matriz!A342,\" - P4 I2\"),\"\")","v":""},{"$f":"IF(CONCATENATE(C$30,K$3)=Matriz!$J$414,CONCATENATE(Matriz!A414,\" - P4 I2\"),\"\")","v":""},{"$f":"IF(CONCATENATE(C$30,Q$3)=Matriz!$J$54,CONCATENATE(Matriz!A54,\" - P4 I3\"),\"\")","v":""},{"$f":"IF(CONCATENATE(C$30,Q$3)=Matriz!$J$126,CONCATENATE(Matriz!A126,\" - P4 I3\"),\"\")","v":""},{"$f":"IF(CONCATENATE(C$30,Q$3)=Matriz!$J$198,CONCATENATE(Matriz!A198,\" - P4 I3\"),\"\")","v":""},{"$f":"IF(CONCATENATE(C$30,Q$3)=Matriz!$J$270,CONCATENATE(Matriz!A270,\" - P4 I3\"),\"\")","v":""},{"$f":"IF(CONCATENATE(C$30,Q$3)=Matriz!$J$342,CONCATENATE(Matriz!A342,\" - P4 I3\"),\"\")","v":""},{"$f":"IF(CONCATENATE(C$30,Q$3)=Matriz!$J$414,CONCATENATE(Matriz!A414,\" - P4 I3\"),\"\")","v":""},{"$f":"IF(CONCATENATE(C$30,W$3)=Matriz!$J$54,CONCATENATE(Matriz!A54,\" - P4 I4\"),\"\")","v":""},{"$f":"IF(CONCATENATE(C$30,W$3)=Matriz!$J$126,CONCATENATE(Matriz!A126,\" - P4 I4\"),\"\")","v":""},{"$f":"IF(CONCATENATE(C$30,W$3)=Matriz!$J$198,CONCATENATE(Matriz!A198,\" - P4 I4\"),\"\")","v":""},{"$f":"IF(CONCATENATE(C$30,W$3)=Matriz!$J$270,CONCATENATE(Matriz!A270,\" - P4 I4\"),\"\")","v":""},{"$f":"IF(CONCATENATE(C$30,W$3)=Matriz!$J$342,CONCATENATE(Matriz!A342,\" - P4 I4\"),\"\")","v":""},{"$f":"IF(CONCATENATE(C$30,W$3)=Matriz!$J$414,CONCATENATE(Matriz!A414,\" - P4 I4\"),\"\")","v":""},{"$f":"IF(CONCATENATE(C$30,AC$3)=Matriz!$J$54,CONCATENATE(Matriz!A54,\" - P4 I5\"),\"\")","v":""},{"$f":"IF(CONCATENATE(C$30,AC$3)=Matriz!$J$126,CONCATENATE(Matriz!A126,\" - P4 I5\"),\"\")","v":""},{"$f":"IF(CONCATENATE(C$30,AC$3)=Matriz!$J$198,CONCATENATE(Matriz!A198,\" - P4 I5\"),\"\")","v":"R22 - P4 I5"},{"$f":"IF(CONCATENATE(C$30,AC$3)=Matriz!$J$270,CONCATENATE(Matriz!A270,\" - P4 I5\"),\"\")","v":""},{"$f":"IF(CONCATENATE(C$30,AC$3)=Matriz!$J$342,CONCATENATE(Matriz!A342,\" - P4 I5\"),\"\")","v":""},{"$f":"IF(CONCATENATE(C$30,AC$3)=Matriz!$J$414,CONCATENATE(Matriz!A414,\" - P4 I5\"),\"\")","v":""}]
[{"$nulls":4},{"$f":"IF(CONCATENATE(C$30,E$3)=Matriz!$J$63,CONCATENATE(Matriz!A63,\" - P4 I1\"),\"\")","v":""},{"$f":"IF(CONCATENATE(C$30,E$3)=Matriz!$J$135,CONCATENATE(Matriz!A135,\" - P4 I1\"),\"\")","v":""},{"$f":"IF(CONCATENATE(C$30,E$3)=Matriz!$J$207,CONCATENATE(Matriz!A207,\" - P4 I1\"),\"\")","v":""},{"$f":"IF(CONCATENATE(C$30,E$3)=Matriz!$J$279,CONCATENATE(Matriz!A279,\" - P4 I1\"),\"\")","v":""},{"$f":"IF(CONCATENATE(C$30,E$3)=Matriz!$J$351,CONCATENATE(Matriz!A351,\" - P4 I1\"),\"\")","v":""},{"$f":"IF(CONCATENATE(C$30,E$3)=Matriz!$J$423,CONCATENATE(Matriz!A423,\" - P4 I1\"),\"\")","v":""},{"$f":"IF(CONCATENATE(C$30,K$3)=Matriz!$J$63,CONCATENATE(Matriz!A63,\" - P4 I2\"),\"\")","v":""},{"$f":"IF(CONCATENATE(C$30,K$3)=Matriz!$J$135,CONCATENATE(Matriz!A135,\" - P4 I2\"),\"\")","v":""},{"$f":"IF(CONCATENATE(C$30,K$3)=Matriz!$J$207,CONCATENATE(Matriz!A207,\" - P4 I2\"),\"\")","v":""},{"$f":"IF(CONCATENATE(C$30,K$3)=Matriz!$J$279,CONCATENATE(Matriz!A279,\" - P4 I2\"),\"\")","v":""},{"$f":"IF(CONCATENATE(C$30,K$3)=Matriz!$J$351,CONCATENATE(Matriz!A351,\" - P4 I2\"),\"\")","v":""},{"$f":"IF(CONCATENATE(C$30,K$3)=Matriz!$J$423,CONCATENATE(Matriz!A423,\" - P4 I2\"),\"\")","v":""},{"$f":"IF(CONCATENATE(C$30,Q$3)=Matriz!$J$63,CONCATENATE(Matriz!A63,\" - P4 I3\"),\"\")","v":""},{"$f":"IF(CONCATENATE(C$30,Q$3)=Matriz!$J$135,CONCATENATE(Matriz!A135,\" - P4 I3\"),\"\")","v":""},{"$f":"IF(CONCATENATE(C$30,Q$3)=Matriz!$J$207,CONCATENATE(Matriz!A207,\" - P4 I3\"),\"\")","v":""},{"$f":"IF(CONCATENATE(C$30,Q$3)=Matriz!$J$279,CONCATENATE(Matriz!A279,\" - P4 I3\"),\"\")","v":""},{"$f":"IF(CONCATENATE(C$30,Q$3)=Matriz!$J$351,CONCATENATE(Matriz!A351,\" - P4 I3\"),\"\")","v":""},{"$f":"IF(CONCATENATE(C$30,Q$3)=Matriz!$J$423,CONCATENATE(Matriz!A423,\" - P4 I3\"),\"\")","v":""},{"$f":"IF(CONCATENATE(C$30,W$3)=Matriz!$J$63,CONCATENATE(Matriz!A63,\" - P4 I4\"),\"\")","v":""},{"$f":"IF(CONCATENATE(C$30,W$3)=Matriz!$J$135,CONCATENATE(Matriz!A135,\" - P4 I4\"),\"\")","v":""},{"$f":"IF(CONCATENATE(C$30,W$3)=Matriz!$J$207,CONCATENATE(Matriz!A207,\" - P4 I4\"),\"\")","v":""},{"$f":"IF(CONCATENATE(C$30,W$3)=Matriz!$J$279,CONCATENATE(Matriz!A279,\" - P4 I4\"),\"\")","v":""},{"$f":"IF(CONCATENATE(C$30,W$3)=Matriz!$J$351,CONCATENATE(Matriz!A351,\" - P4 I4\"),\"\")","v":""},{"$f":"IF(CONCATENATE(C$30,W$3)=Matriz!$J$423,CONCATENATE(Matriz!A423,\" - P4 I4\"),\"\")","v":""},{"$f":"IF(CONCATENATE(C$30,AC$3)=Matriz!$J$63,CONCATENATE(Matriz!A63,\" - P4 I5\"),\"\")","v":""},{"$f":"IF(CONCATENATE(C$30,AC$3)=Matriz!$J$135,CONCATENATE(Matriz!A135,\" - P4 I5\"),\"\")","v":""},{"$f":"IF(CONCATENATE(C$30,AC$3)=Matriz!$J$207,CONCATENATE(Matriz!A207,\" - P4 I5\"),\"\")","v":""},{"$f":"IF(CONCATENATE(C$30,AC$3)=Matriz!$J$279,CONCATENATE(Matriz!A279,\" - P4 I5\"),\"\")","v":""},{"$f":"IF(CONCATENATE(C$30,AC$3)=Matriz!$J$351,CONCATENATE(Matriz!A351,\" - P4 I5\"),\"\")","v":""},{"$f":"IF(CONCATENATE(C$30,AC$3)=Matriz!$J$423,CONCATENATE(Matriz!A423,\" - P4 I5\"),\"\")","v":""}]
[{"$nulls":4},{"$f":"IF(CONCATENATE(C$30,E$3)=Matriz!$J$72,CONCATENATE(Matriz!A72,\" - P4 I1\"),\"\")","v":""},{"$f":"IF(CONCATENATE(C$30,E$3)=Matriz!$J$144,CONCATENATE(Matriz!A144,\" - P4 I1\"),\"\")","v":""},{"$f":"IF(CONCATENATE(C$30,E$3)=Matriz!$J$216,CONCATENATE(Matriz!A216,\" - P4 I1\"),\"\")","v":""},{"$f":"IF(CONCATENATE(C$30,E$3)=Matriz!$J$288,CONCATENATE(Matriz!A288,\" - P4 I1\"),\"\")","v":""},{"$f":"IF(CONCATENATE(C$30,E$3)=Matriz!$J$360,CONCATENATE(Matriz!A360,\" - P4 I1\"),\"\")","v":""},{"$f":"IF(CONCATENATE(C$30,E$3)=Matriz!$J$432,CONCATENATE(Matriz!A432,\" - P4 I1\"),\"\")","v":""},{"$f":"IF(CONCATENATE(C$30,K$3)=Matriz!$J$72,CONCATENATE(Matriz!A72,\" - P4 I2\"),\"\")","v":""},{"$f":"IF(CONCATENATE(C$30,K$3)=Matriz!$J$144,CONCATENATE(Matriz!A144,\" - P4 I2\"),\"\")","v":""},{"$f":"IF(CONCATENATE(C$30,K$3)=Matriz!$J$216,CONCATENATE(Matriz!A216,\" - P4 I2\"),\"\")","v":""},{"$f":"IF(CONCATENATE(C$30,K$3)=Matriz!$J$288,CONCATENATE(Matriz!A288,\" - P4 I2\"),\"\")","v":""},{"$f":"IF(CONCATENATE(C$30,K$3)=Matriz!$J$360,CONCATENATE(Matriz!A360,\" - P4 I2\"),\"\")","v":""},{"$f":"IF(CONCATENATE(C$30,K$3)=Matriz!$J$432,CONCATENATE(Matriz!A432,\" - P4 I2\"),\"\")","v":""},{"$f":"IF(CONCATENATE(C$30,Q$3)=Matriz!$J$72,CONCATENATE(Matriz!A72,\" - P4 I3\"),\"\")","v":""},{"$f":"IF(CONCATENATE(C$30,Q$3)=Matriz!$J$144,CONCATENATE(Matriz!A144,\" - P4 I3\"),\"\")","v":""},{"$f":"IF(CONCATENATE(C$30,Q$3)=Matriz!$J$216,CONCATENATE(Matriz!A216,\" - P4 I3\"),\"\")","v":""},{"$f":"IF(CONCATENATE(C$30,Q$3)=Matriz!$J$288,CONCATENATE(Matriz!A288,\" - P4 I3\"),\"\")","v":""},{"$f":"IF(CONCATENATE(C$30,Q$3)=Matriz!$J$360,CONCATENATE(Matriz!A360,\" - P4 I3\"),\"\")","v":""},{"$f":"IF(CONCATENATE(C$30,Q$3)=Matriz!$J$432,CONCATENATE(Matriz!A432,\" - P4 I3\"),\"\")","v":""},{"$f":"IF(CONCATENATE(C$30,W$3)=Matriz!$J$72,CONCATENATE(Matriz!A72,\" - P4 I4\"),\"\")","v":""},{"$f":"IF(CONCATENATE(C$30,W$3)=Matriz!$J$144,CONCATENATE(Matriz!A144,\" - P4 I4\"),\"\")","v":""},{"$f":"IF(CONCATENATE(C$30,W$3)=Matriz!$J$216,CONCATENATE(Matriz!A216,\" - P4 I4\"),\"\")","v":""},{"$f":"IF(CONCATENATE(C$30,W$3)=Matriz!$J$288,CONCATENATE(Matriz!A288,\" - P4 I4\"),\"\")","v":"R32 - P4 I4"},{"$f":"IF(CONCATENATE(C$30,W$3)=Matriz!$J$360,CONCATENATE(Matriz!A360,\" - P4 I4\"),\"\")","v":""},{"$f":"IF(CONCATENATE(C$30,W$3)=Matriz!$J$432,CONCATENATE(Matriz!A432,\" - P4 I4\"),\"\")","v":""},{"$f":"IF(CONCATENATE(C$30,AC$3)=Matriz!$J$72,CONCATENATE(Matriz!A72,\" - P4 I5\"),\"\")","v":""},{"$f":"IF(CONCATENATE(C$30,AC$3)=Matriz!$J$144,CONCATENATE(Matriz!A144,\" - P4 I5\"),\"\")","v":""},{"$f":"IF(CONCATENATE(C$30,AC$3)=Matriz!$J$216,CONCATENATE(Matriz!A216,\" - P4 I5\"),\"\")","v":""},{"$f":"IF(CONCATENATE(C$30,AC$3)=Matriz!$J$288,CONCATENATE(Matriz!A288,\" - P4 I5\"),\"\")","v":""},{"$f":"IF(CONCATENATE(C$30,AC$3)=Matriz!$J$360,CONCATENATE(Matriz!A360,\" - P4 I5\"),\"\")","v":""},{"$f":"IF(CONCATENATE(C$30,AC$3)=Matriz!$J$432,CONCATENATE(Matriz!A432,\" - P4 I5\"),\"\")","v":""}]
[null,null,5,"CASI SEGURO",{"$f":"IF(CONCATENATE(C$38,E$3)=Matriz!$J$9,CONCATENATE(Matriz!A$9,\" - P5 I1\"),\"\")","v":""},{"$f":"IF(CONCATENATE($C$38,E$3)=Matriz!$J$81,CONCATENATE(Matriz!A$81,\" - P5 I1\"),\"\")","v":""},{"$f":"IF(CONCATENATE($C$38,E$3)=Matriz!$J$153,CONCATENATE(Matriz!A$153,\" - P5 I1\"),\"\")","v":""},{"$f":"IF(CONCATENATE($C$38,E$3)=Matriz!$J$225,CONCATENATE(Matriz!A$225,\" - P5 I1\"),\"\")","v":""},{"$f":"IF(CONCATENATE($C$38,E$3)=Matriz!$J$297,CONCATENATE(Matriz!A$297,\" - P5 I1\"),\"\")","v":""},{"$f":"IF(CONCATENATE($C$38,E$3)=Matriz!$J$369,CONCATENATE(Matriz!A$369,\" - P5 I1\"),\"\")","v":""},{"$f":"IF(CONCATENATE(C$38,K$3)=Matriz!$J$9,CONCATENATE(Matriz!A$9,\" - P5 I2\"),\"\")","v":""},{"$f":"IF(CONCATENATE($C$38,K$3)=Matriz!$J$81,CONCATENATE(Matriz!A$81,\" - P5 I2\"),\"\")","v":""},{"$f":"IF(CONCATENATE($C$38,K$3)=Matriz!$J$153,CONCATENATE(Matriz!A$153,\" - P5 I2\"),\"\")","v":""},{"$f":"IF(CONCATENATE($C$38,K$3)=Matriz!$J$225,CONCATENATE(Matriz!A$225,\" - P5 I2\"),\"\")","v":""},{"$f":"IF(CONCATENATE($C$38,K$3)=Matriz!$J$297,CONCATENATE(Matriz!A$297,\" - P5 I2\"),\"\")","v":""},{"$f":"IF(CONCATENATE($C$38,K$3)=Matriz!$J$369,CONCATENATE(Matriz!A$369,\" - P5 I2\"),\"\")","v":""},{"$f":"IF(CONCATENATE(C$38,Q$3)=Matriz!$J$9,CONCATENATE(Matriz!A$9,\" - P5 I3\"),\"\")","v":""},{"$f":"IF(CONCATENATE($C$38,Q$3)=Matriz!$J$81,CONCATENATE(Matriz!A$81,\" - P5 I3\"),\"\")","v":""},{"$f":"IF(CONCATENATE($C$38,Q$3)=Matriz!$J$153,CONCATENATE(Matriz!A$153,\" - P5 I3\"),\"\")","v":""},{"$f":"IF(CONCATENATE($C$38,Q$3)=Matriz!$J$225,CONCATENATE(Matriz!A$225,\" - P5 I3\"),\"\")","v":""},{"$f":"IF(CONCATENATE($C$38,Q$3)=Matriz!$J$297,CONCATENATE(Matriz!A$297,\" - P5 I3\"),\"\")","v":""},{"$f":"IF(CONCATENATE($C$38,Q$3)=Matriz!$J$369,CONCATENATE(Matriz!A$369,\" - P5 I3\"),\"\")","v":""},{"$f":"IF(CONCATENATE($C$38,W$3)=Matriz!$J$9,CONCATENATE(Matriz!A$9,\" - P5 I4\"),\"\")","v":"R1 - P5 I4"},{"$f":"IF(CONCATENATE($C$38,W$3)=Matriz!$J$81,CONCATENATE(Matriz!A$81,\" - P5 I4\"),\"\")","v":""},{"$f":"IF(CONCATENATE($C$38,W$3)=Matriz!$J$153,CONCATENATE(Matriz!A$153,\" - P5 I4\"),\"\")","v":"R17 - P5 I4"},{"$f":"IF(CONCATENATE($C$38,W$3)=Matriz!$J$225,CONCATENATE(Matriz!A$225,\" - P5 I4\"),\"\")","v":""},{"$f":"IF(CONCATENATE($C$38,W$3)=Matriz!$J$297,CONCATENATE(Matriz!A$297,\" - P5 I4\"),\"\")","v":""},{"$f":"IF(CONCATENATE($C$38,W$3)=Matriz!$J$369,CONCATENATE(Matriz!A$369,\" - P5 I4\"),\"\")","v":""},{"$f":"IF(CONCATENATE($C$38,AC$3)=Matriz!$J$9,CONCATENATE(Matriz!A$9,\" - P5 I5\"),\"\")","v":""},{"$f":"IF(CONCATENATE($C$38,AC$3)=Matriz!$J$81,CONCATENATE(Matriz!A$81,\" - P5 I5\"),\"\")","v":""},{"$f":"IF(CONCATENATE($C$38,AC$3)=Matriz!$J$153,CONCATENATE(Matriz!A$153,\" - P5 I5\"),\"\")","v":""},{"$f":"IF(CONCATENATE($C$38,AC$3)=Matriz!$J$225,CONCATENATE(Matriz!A$225,\" - P5 I5\"),\"\")","v":""},{"$f":"IF(CONCATENATE($C$38,AC$3)=Matriz!$J$297,CONCATENATE(Matriz!A$297,\" - P5 I5\"),\"\")","v":""},{"$f":"IF(CONCATENATE($C$38,AC$3)=Matriz!$J$369,CONCATENATE(Matriz!A$369,\" - P5 I5\"),\"\")","v":""}]
[{"$nulls":4},{"$f":"IF(CONCATENATE($C$38,E$3)=Matriz!$J$18,CONCATENATE(Matriz!A$18,\" - P5 I1\"),\"\")","v":""},{"$f":"IF(CONCATENATE($C$38,E$3)=Matriz!$J$90,CONCATENATE(Matriz!A$90,\" - P5 I1\"),\"\")","v":""},{"$f":"IF(CONCATENATE($C$38,E$3)=Matriz!$J$162,CONCATENATE(Matriz!A$162,\" - P5 I1\"),\"\")","v":""},{"$f":"IF(CONCATENATE($C$38,E$3)=Matriz!$J$234,CONCATENATE(Matriz!A$234,\" - P5 I1\"),\"\")","v":""},{"$f":"IF(CONCATENATE($C$38,E$3)=Matriz!$J$306,CONCATENATE(Matriz!A$306,\" - P5 I1\"),\"\")","v":""},{"$f":"IF(CONCATENATE($C$38,E$3)=Matriz!$J$378,CONCATENATE(Matriz!A$378,\" - P5 I1\"),\"\")","v":""},{"$f":"IF(CONCATENATE($C$38,K$3)=Matriz!$J$18,CONCATENATE(Matriz!A$18,\" - P5 I2\"),\"\")","v":""},{"$f":"IF(CONCATENATE($C$38,K$3)=Matriz!$J$90,CONCATENATE(Matriz!A$90,\" - P5 I2\"),\"\")","v":""},{"$f":"IF(CONCATENATE($C$38,K$3)=Matriz!$J$162,CONCATENATE(Matriz!A$162,\" - P5 I2\"),\"\")","v":""},{"$f":"IF(CONCATENATE($C$38,K$3)=Matriz!$J$234,CONCATENATE(Matriz!A$234,\" - P5 I2\"),\"\")","v":""},{"$f":"IF(CONCATENATE($C$38,K$3)=Matriz!$J$306,CONCATENATE(Matriz!A$306,\" - P5 I2\"),\"\")","v":""},{"$f":"IF(CONCATENATE($C$38,K$3)=Matriz!$J$378,CONCATENATE(Matriz!A$378,\" - P5 I2\"),\"\")","v":""},{"$f":"IF(CONCATENATE($C$38,Q$3)=Matriz!$J$18,CONCATENATE(Matriz!A$18,\" - P5 I3\"),\"\")","v":""},{"$f":"IF(CONCATENATE($C$38,Q$3)=Matriz!$J$90,CONCATENATE(Matriz!A$90,\" - P5 I3\"),\"\")","v":""},{"$f":"IF(CONCATENATE($C$38,Q$3)=Matriz!$J$162,CONCATENATE(Matriz!A$162,\" - P5 I3\"),\"\")","v":""},{"$f":"IF(CONCATENATE($C$38,Q$3)=Matriz!$J$234,CONCATENATE(Matriz!A$234,\" - P5 I3\"),\"\")","v":""},{"$f":"IF(CONCATENATE($C$38,Q$3)=Matriz!$J$306,CONCATENATE(Matriz!A$306,\" - P5 I3\"),\"\")","v":""},null,{"$f":"IF(CONCATENATE($C$38,W$3)=Matriz!$J$18,CONCATENATE(Matriz!A$18,\" - P5 I4\"),\"\")","v":""},{"$f":"IF(CONCATENATE($C$38,W$3)=Matriz!$J$90,CONCATENATE(Matriz!A$90,\" - P5 I4\"),\"\")","v":""},{"$f":"IF(CONCATENATE($C$38,W$3)=Matriz!$J$162,CONCATENATE(Matriz!A$162,\" - P5 I4\"),\"\")","v":""},{"$f":"IF(CONCATENATE($C$38,W$3)=Matriz!$J$234,CONCATENATE(Matriz!A$234,\" - P5 I4\"),\"\")","v":""},{"$f":"IF(CONCATENATE($C$38,W$3)=Matriz!$J$306,CONCATENATE(Matriz!A$306,\" - P5 I4\"),\"\")","v":""},{"$f":"IF(CONCATENATE($C$38,W$3)=Matriz!$J$378,CONCATENATE(Matriz!A$378,\" - P5 I4\"),\"\")","v":""},{"$f":"IF(CONCATENATE($C$38,AC$3)=Matriz!$J$18,CONCATENATE(Matriz!A$18,\" - P5 I5\"),\"\")","v":""},{"$f":"IF(CONCATENATE($C$38,AC$3)=Matriz!$J$90,CONCATENATE(Matriz!A$90,\" - P5 I5\"),\"\")","v":""},{"$f":"IF(CONCATENATE($C$38,AC$3)=Matriz!$J$162,CONCATENATE(Matriz!A$162,\" - P5 I5\"),\"\")","v":""},{"$f":"IF(CONCATENATE($C$38,AC$3)=Matriz!$J$234,CONCATENATE(Matriz!A$234,\" - P5 I5\"),\"\")","v":""},{"$f":"IF(CONCATENATE($C$38,AC$3)=Matriz!$J$306,CONCATENATE(Matriz!A$306,\" - P5 I5\"),\"\")","v":""},{"$f":"IF(CONCATENATE($C$38,AC$3)=Matriz!$J$378,CONCATENATE(Matriz!A$378,\" - P5 I5\"),\"\")","v":""}]
[{"$nulls":4},{"$f":"IF(CONCATENATE($C$38,E$3)=Matriz!$J$27,CONCATENATE(Matriz!A$27,\" - P5 I1\"),\"\")","v":""},{"$f":"IF(CONCATENATE($C$38,E$3)=Matriz!$J$99,CONCATENATE(Matriz!A$99,\" - P5 I1\"),\"\")","v":""},{"$f":"IF(CONCATENATE($C$38,E$3)=Matriz!$J$171,CONCATENATE(Matriz!A$171,\" - P5 I1\"),\"\")","v":""},{"$f":"IF(CONCATENATE($C$38,E$3)=Matriz!$J$243,CONCATENATE(Matriz!A$243,\" - P5 I1\"),\"\")","v":""},{"$f":"IF(CONCATENATE($C$38,E$3)=Matriz!$J$315,CONCATENATE(Matriz!A$315,\" - P5 I1\"),\"\")","v":""},{"$f":"IF(CONCATENATE($C$38,E$3)=Matriz!$J$387,CONCATENATE(Matriz!A$387,\" - P5 I1\"),\"\")","v":""},{"$f":"IF(CONCATENATE($C$38,K$3)=Matriz!$J$27,CONCATENATE(Matriz!A$27,\" - P5 I2\"),\"\")","v":""},{"$f":"IF(CONCATENATE($C$38,K$3)=Matriz!$J$99,CONCATENATE(Matriz!A$99,\" - P5 I2\"),\"\")","v":""},{"$f":"IF(CONCATENATE($C$38,K$3)=Matriz!$J$171,CONCATENATE(Matriz!A$171,\" - P5 I2\"),\"\")","v":""},{"$f":"IF(CONCATENATE($C$38,K$3)=Matriz!$J$243,CONCATENATE(Matriz!A$243,\" - P5 I2\"),\"\")","v":""},{"$f":"IF(CONCATENATE($C$38,K$3)=Matriz!$J$315,CONCATENATE(Matriz!A$315,\" - P5 I2\"),\"\")","v":""},{"$f":"IF(CONCATENATE($C$38,K$3)=Matriz!$J$387,CONCATENATE(Matriz!A$387,\" - P5 I2\"),\"\")","v":""},{"$f":"IF(CONCATENATE($C$38,Q$3)=Matriz!$J$27,CONCATENATE(Matriz!A$27,\" - P5 I3\"),\"\")","v":""},{"$f":"IF(CONCATENATE($C$38,Q$3)=Matriz!$J$99,CONCATENATE(Matriz!A$99,\" - P5 I3\"),\"\")","v":""},{"$f":"IF(CONCATENATE($C$38,Q$3)=Matriz!$J$171,CONCATENATE(Matriz!A$171,\" - P5 I3\"),\"\")","v":""},{"$f":"IF(CONCATENATE($C$38,Q$3)=Matriz!$J$243,CONCATENATE(Matriz!A$243,\" - P5 I3\"),\"\")","v":""},{"$f":"IF(CONCATENATE($C$38,Q$3)=Matriz!$J$315,CONCATENATE(Matriz!A$315,\" - P5 I3\"),\"\")","v":""},null,{"$f":"IF(CONCATENATE($C$38,W$3)=Matriz!$J$27,CONCATENATE(Matriz!A$27,\" - P5 I4\"),\"\")","v":""},{"$f":"IF(CONCATENATE($C$38,W$3)=Matriz!$J$99,CONCATENATE(Matriz!A$99,\" - P5 I4\"),\"\")","v":""},{"$f":"IF(CONCATENATE($C$38,W$3)=Matriz!$J$171,CONCATENATE(Matriz!A$171,\" - P5 I4\"),\"\")","v":""},{"$f":"IF(CONCATENATE($C$38,W$3)=Matriz!$J$243,CONCATENATE(Matriz!A$243,\" - P5 I4\"),\"\")","v":""},{"$f":"IF(CONCATENATE($C$38,W$3)=Matriz!$J$315,CONCATENATE(Matriz!A$315,\" - P5 I4\"),\"\")","v":""},{"$f":"IF(CONCATENATE($C$38,W$3)=Matriz!$J$387,CONCATENATE(Matriz!A$387,\" - P5 I4\"),\"\")","v":""},{"$f":"IF(CONCATENATE($C$38,AC$3)=Matriz!$J$27,CONCATENATE(Matriz!A$27,\" - P5 I5\"),\"\")","v":"R3 - P5 I5"},{"$f":"IF(CONCATENATE($C$38,AC$3)=Matriz!$J$99,CONCATENATE(Matriz!A$99,\" - P5 I5\"),\"\")","v":""},{"$f":"IF(CONCATENATE($C$38,AC$3)=Matriz!$J$171,CONCATENATE(Matriz!A$171,\" - P5 I5\"),\"\")","v":""},{"$f":"IF(CONCATENATE($C$38,AC$3)=Matriz!$J$243,CONCATENATE(Matriz!A$243,\" - P5 I5\"),\"\")","v":""},{"$f":"IF(CONCATENATE($C$38,AC$3)=Matriz!$J$315,CONCATENATE(Matriz!A$315,\" - P5 I5\"),\"\")","v":""},{"$f":"IF(CONCATENATE($C$38,AC$3)=Matriz!$J$387,CONCATENATE(Matriz!A$387,\" - P5 I5\"),\"\")","v":""}]
[{"$nulls":4},{"$f":"IF(CONCATENATE($C$38,E$3)=Matriz!$J$36,CONCATENATE(Matriz!A$36,\" - P5 I1\"),\"\")","v":""},{"$f":"IF(CONCATENATE($C$38,E$3)=Matriz!$J$108,CONCATENATE(Matriz!A$108,\" - P5 I1\"),\"\")","v":""},{"$f":"IF(CONCATENATE($C$38,E$3)=Matriz!$J$180,CONCATENATE(Matriz!A$180,\" - P5 I1\"),\"\")","v":""},{"$f":"IF(CONCATENATE($C$38,E$3)=Matriz!$J$252,CONCATENATE(Matriz!A$252,\" - P5 I1\"),\"\")","v":""},{"$f":"IF(CONCATENATE($C$38,E$3)=Matriz!$J$324,CONCATENATE(Matriz!A$324,\" - P5 I1\"),\"\")","v":""},{"$f":"IF(CONCATENATE($C$38,E$3)=Matriz!$J$396,CONCATENATE(Matriz!A$396,\" - P5 I1\"),\"\")","v":""},{"$f":"IF(CONCATENATE($C$38,K$3)=Matriz!$J$36,CONCATENATE(Matriz!A$36,\" - P5 I2\"),\"\")","v":""},{"$f":"IF(CONCATENATE($C$38,K$3)=Matriz!$J$108,CONCATENATE(Matriz!A$108,\" - P5 I2\"),\"\")","v":""},{"$f":"IF(CONCATENATE($C$38,K$3)=Matriz!$J$180,CONCATENATE(Matriz!A$180,\" - P5 I2\"),\"\")","v":""},{"$f":"IF(CONCATENATE($C$38,K$3)=Matriz!$J$252,CONCATENATE(Matriz!A$252,\" - P5 I2\"),\"\")","v":""},{"$f":"IF(CONCATENATE($C$38,K$3)=Matriz!$J$324,CONCATENATE(Matriz!A$324,\" - P5 I2\"),\"\")","v":""},{"$f":"IF(CONCATENATE($C$38,K$3)=Matriz!$J$396,CONCATENATE(Matriz!A$396,\" - P5 I2\"),\"\")","v":""},{"$f":"IF(CONCATENATE($C$38,Q$3)=Matriz!$J$36,CONCATENATE(Matriz!A$36,\" - P5 I3\"),\"\")","v":""},{"$f":"IF(CONCATENATE($C$38,Q$3)=Matriz!$J$108,CONCATENATE(Matriz!A$108,\" - P5 I3\"),\"\")","v":""},{"$f":"IF(CONCATENATE($C$38,Q$3)=Matriz!$J$180,CONCATENATE(Matriz!A$180,\" - P5 I3\"),\"\")","v":""},{"$f":"IF(CONCATENATE($C$38,Q$3)=Matriz!$J$252,CONCATENATE(Matriz!A$252,\" - P5 I3\"),\"\")","v":""},{"$f":"IF(CONCATENATE($C$38,Q$3)=Matriz!$J$324,CONCATENATE(Matriz!A$324,\" - P5 I3\"),\"\")","v":""},null,{"$f":"IF(CONCATENATE($C$38,W$3)=Matriz!$J$36,CONCATENATE(Matriz!A$36,\" - P5 I4\"),\"\")","v":""},{"$f":"IF(CONCATENATE($C$38,W$3)=Matriz!$J$108,CONCATENATE(Matriz!A$108,\" - P5 I4\"),\"\")","v":""},{"$f":"IF(CONCATENATE($C$38,W$3)=Matriz!$J$180,CONCATENATE(Matriz!A$180,\" - P5 I4\"),\"\")","v":""},{"$f":"IF(CONCATENATE($C$38,W$3)=Matriz!$J$252,CONCATENATE(Matriz!A$252,\" - P5 I4\"),\"\")","v":""},{"$f":"IF(CONCATENATE($C$38,W$3)=Matriz!$J$324,CONCATENATE(Matriz!A$324,\" - P5 I4\"),\"\")","v":""},{"$f":"IF(CONCATENATE($C$38,W$3)=Matriz!$J$396,CONCATENATE(Matriz!A$396,\" - P5 I4\"),\"\")","v":""},{"$f":"IF(CONCATENATE($C$38,AC$3)=Matriz!$J$36,CONCATENATE(Matriz!A$36,\" - P5 I5\"),\"\")","v":""},{"$f":"IF(CONCATENATE($C$38,AC$3)=Matriz!$J$108,CONCATENATE(Matriz!A$108,\" - P5 I5\"),\"\")","v":""},{"$f":"IF(CONCATENATE($C$38,AC$3)=Matriz!$J$180,CONCATENATE(Matriz!A$180,\" - P5 I5\"),\"\")","v":""},{"$f":"IF(CONCATENATE($C$38,AC$3)=Matriz!$J$252,CONCATENATE(Matriz!A$252,\" - P5 I5\"),\"\")","v":""},{"$f":"IF(CONCATENATE($C$38,AC$3)=Matriz!$J$324,CONCATENATE(Matriz!A$324,\" - P5 I5\"),\"\")","v":""},{"$f":"IF(CONCATENATE($C$38,AC$3)=Matriz!$J$396,CONCATENATE(Matriz!A$396,\" - P5 I5\"),\"\")","v":""}]
[{"$nulls":4},{"$f":"IF(CONCATENATE($C$38,E$3)=Matriz!$J$45,CONCATENATE(Matriz!A$45,\" - P5 I1\"),\"\")","v":""},{"$f":"IF(CONCATENATE($C$38,E$3)=Matriz!$J$117,CONCATENATE(Matriz!A$117,\" - P5 I1\"),\"\")","v":""},{"$f":"IF(CONCATENATE($C$38,E$3)=Matriz!$J$189,CONCATENATE(Matriz!A$189,\" - P5 I1\"),\"\")","v":""},{"$f":"IF(CONCATENATE($C$38,E$3)=Matriz!$J$261,CONCATENATE(Matriz!A$261,\" - P5 I1\"),\"\")","v":""},{"$f":"IF(CONCATENATE($C$38,E$3)=Matriz!$J$333,CONCATENATE(Matriz!A$333,\" - P5 I1\"),\"\")","v":""},{"$f":"IF(CONCATENATE($C$38,E$3)=Matriz!$J$405,CONCATENATE(Matriz!A$405,\" - P5 I1\"),\"\")","v":""},{"$f":"IF(CONCATENATE($C$38,K$3)=Matriz!$J$45,CONCATENATE(Matriz!A$45,\" - P5 I2\"),\"\")","v":""},{"$f":"IF(CONCATENATE($C$38,K$3)=Matriz!$J$117,CONCATENATE(Matriz!A$117,\" - P5 I2\"),\"\")","v":""},{"$f":"IF(CONCATENATE($C$38,K$3)=Matriz!$J$189,CONCATENATE(Matriz!A$189,\" - P5 I2\"),\"\")","v":""},{"$f":"IF(CONCATENATE($C$38,K$3)=Matriz!$J$261,CONCATENATE(Matriz!A$261,\" - P5 I2\"),\"\")","v":""},{"$f":"IF(CONCATENATE($C$38,K$3)=Matriz!$J$333,CONCATENATE(Matriz!A$333,\" - P5 I2\"),\"\")","v":""},{"$f":"IF(CONCATENATE($C$38,K$3)=Matriz!$J$405,CONCATENATE(Matriz!A$405,\" - P5 I2\"),\"\")","v":""},{"$f":"IF(CONCATENATE($C$38,Q$3)=Matriz!$J$45,CONCATENATE(Matriz!A$45,\" - P5 I3\"),\"\")","v":""},{"$f":"IF(CONCATENATE($C$38,Q$3)=Matriz!$J$117,CONCATENATE(Matriz!A$117,\" - P5 I3\"),\"\")","v":""},{"$f":"IF(CONCATENATE($C$38,Q$3)=Matriz!$J$189,CONCATENATE(Matriz!A$189,\" - P5 I3\"),\"\")","v":""},{"$f":"IF(CONCATENATE($C$38,Q$3)=Matriz!$J$261,CONCATENATE(Matriz!A$261,\" - P5 I3\"),\"\")","v":""},{"$f":"IF(CONCATENATE($C$38,Q$3)=Matriz!$J$333,CONCATENATE(Matriz!A$333,\" - P5 I3\"),\"\")","v":""},null,{"$f":"IF(CONCATENATE($C$38,W$3)=Matriz!$J$45,CONCATENATE(Matriz!A$45,\" - P5 I4\"),\"\")","v":"R5 - P5 I4"},{"$f":"IF(CONCATENATE($C$38,W$3)=Matriz!$J$117,CONCATENATE(Matriz!A$117,\" - P5 I4\"),\"\")","v":""},{"$f":"IF(CONCATENATE($C$38,W$3)=Matriz!$J$189,CONCATENATE(Matriz!A$189,\" - P5 I4\"),\"\")","v":""},{"$f":"IF(CONCATENATE($C$38,W$3)=Matriz!$J$261,CONCATENATE(Matriz!A$261,\" - P5 I4\"),\"\")","v":""},{"$f":"IF(CONCATENATE($C$38,W$3)=Matriz!$J$333,CONCATENATE(Matriz!A$333,\" - P5 I4\"),\"\")","v":""},{"$f":"IF(CONCATENATE($C$38,W$3)=Matriz!$J$405,CONCATENATE(Matriz!A$405,\" - P5 I4\"),\"\")","v":""},{"$f":"IF(CONCATENATE($C$38,AC$3)=Matriz!$J$45,CONCATENATE(Matriz!A$45,\" - P5 I5\"),\"\")","v":""},{"$f":"IF(CONCATENATE($C$38,AC$3)=Matriz!$J$117,CONCATENATE(Matriz!A$117,\" - P5 I5\"),\"\")","v":""},{"$f":"IF(CONCATENATE($C$38,AC$3)=Matriz!$J$189,CONCATENATE(Matriz!A$189,\" - P5 I5\"),\"\")","v":"R21 - P5 I5"},{"$f":"IF(CONCATENATE($C$38,AC$3)=Matriz!$J$261,CONCATENATE(Matriz!A$261,\" - P5 I5\"),\"\")","v":""},{"$f":"IF(CONCATENATE($C$38,AC$3)=Matriz!$J$333,CONCATENATE(Matriz!A$333,\" - P5 I5\"),\"\")","v":""},{"$f":"IF(CONCATENATE($C$38,AC$3)=Matriz!$J$405,CONCATENATE(Matriz!A$405,\" - P5 I5\"),\"\")","v":""},{"$nulls":5},9,22,198]
[{"$nulls":4},{"$f":"IF(CONCATENATE($C$38,E$3)=Matriz!$J$54,CONCATENATE(Matriz!A$54,\" - P5 I1\"),\"\")","v":""},{"$f":"IF(CONCATENATE($C$38,E$3)=Matriz!$J$126,CONCATENATE(Matriz!A$126,\" - P5 I1\"),\"\")","v":""},{"$f":"IF(CONCATENATE($C$38,E$3)=Matriz!$J$198,CONCATENATE(Matriz!A$198,\" - P5 I1\"),\"\")","v":""},{"$f":"IF(CONCATENATE($C$38,E$3)=Matriz!$J$270,CONCATENATE(Matriz!A$270,\" - P5 I1\"),\"\")","v":""},{"$f":"IF(CONCATENATE($C$38,E$3)=Matriz!$J$342,CONCATENATE(Matriz!A$342,\" - P5 I1\"),\"\")","v":""},{"$f":"IF(CONCATENATE($C$38,E$3)=Matriz!$J$414,CONCATENATE(Matriz!A$414,\" - P5 I1\"),\"\")","v":""},{"$f":"IF(CONCATENATE($C$38,K$3)=Matriz!$J$54,CONCATENATE(Matriz!A$54,\" - P5 I2\"),\"\")","v":""},{"$f":"IF(CONCATENATE($C$38,K$3)=Matriz!$J$126,CONCATENATE(Matriz!A$126,\" - P5 I2\"),\"\")","v":""},{"$f":"IF(CONCATENATE($C$38,K$3)=Matriz!$J$198,CONCATENATE(Matriz!A$198,\" - P5 I2\"),\"\")","v":""},{"$f":"IF(CONCATENATE($C$38,K$3)=Matriz!$J$270,CONCATENATE(Matriz!A$270,\" - P5 I2\"),\"\")","v":""},{"$f":"IF(CONCATENATE($C$38,K$3)=Matriz!$J$342,CONCATENATE(Matriz!A$342,\" - P5 I2\"),\"\")","v":""},{"$f":"IF(CONCATENATE($C$38,K$3)=Matriz!$J$414,CONCATENATE(Matriz!A$414,\" - P5 I2\"),\"\")","v":""},{"$f":"IF(CONCATENATE($C$38,Q$3)=Matriz!$J$54,CONCATENATE(Matriz!A$54,\" - P5 I3\"),\"\")","v":""},{"$f":"IF(CONCATENATE($C$38,Q$3)=Matriz!$J$126,CONCATENATE(Matriz!A$126,\" - P5 I3\"),\"\")","v":""},{"$f":"IF(CONCATENATE($C$38,Q$3)=Matriz!$J$198,CONCATENATE(Matriz!A$198,\" - P5 I3\"),\"\")","v":""},{"$f":"IF(CONCATENATE($C$38,Q$3)=Matriz!$J$270,CONCATENATE(Matriz!A$270,\" - P5 I3\"),\"\")","v":""},{"$f":"IF(CONCATENATE($C$38,Q$3)=Matriz!$J$342,CONCATENATE(Matriz!A$342,\" - P5 I3\"),\"\")","v":""},null,{"$f":"IF(CONCATENATE($C$38,W$3)=Matriz!$J$54,CONCATENATE(Matriz!A$54,\" - P5 I4\"),\"\")","v":""},{"$f":"IF(CONCATENATE($C$38,W$3)=Matriz!$J$126,CONCATENATE(Matriz!A$126,\" - P5 I4\"),\"\")","v":"R14 - P5 I4"},{"$f":"IF(CONCATENATE($C$38,W$3)=Matriz!$J$198,CONCATENATE(Matriz!A$198,\" - P5 I4\"),\"\")","v":""},{"$f":"IF(CONCATENATE($C$38,W$3)=Matriz!$J$270,CONCATENATE(Matriz!A$270,\" - P5 I4\"),\"\")","v":""},{"$f":"IF(CONCATENATE($C$38,W$3)=Matriz!$J$342,CONCATENATE(Matriz!A$342,\" - P5 I4\"),\"\")","v":""},{"$f":"IF(CONCATENATE($C$38,W$3)=Matriz!$J$414,CONCATENATE(Matriz!A$414,\" - P5 I4\"),\"\")","v":""},{"$f":"IF(CONCATENATE($C$38,AC$3)=Matriz!$J$54,CONCATENATE(Matriz!A$54,\" - P5 I5\"),\"\")","v":""},{"$f":"IF(CONCATENATE($C$38,AC$3)=Matriz!$J$126,CONCATENATE(Matriz!A$126,\" - P5 I5\"),\"\")","v":""},{"$f":"IF(CONCATENATE($C$38,AC$3)=Matriz!$J$198,CONCATENATE(Matriz!A$198,\" - P5 I5\"),\"\")","v":""},{"$f":"IF(CONCATENATE($C$38,AC$3)=Matriz!$J$270,CONCATENATE(Matriz!A$270,\" - P5 I5\"),\"\")","v":""},{"$f":"IF(CONCATENATE($C$38,AC$3)=Matriz!$J$342,CONCATENATE(Matriz!A$342,\" - P5 I5\"),\"\")","v":""},{"$f":"IF(CONCATENATE($C$38,AC$3)=Matriz!$J$414,CONCATENATE(Matriz!A$414,\" - P5 I5\"),\"\")","v":""},{"$nulls":5},9,23,207]
[{"$nulls":4},{"$f":"IF(CONCATENATE($C$38,E$3)=Matriz!$J$63,CONCATENATE(Matriz!A$63,\" - P5 I1\"),\"\")","v":""},{"$f":"IF(CONCATENATE($C$38,E$3)=Matriz!$J$135,CONCATENATE(Matriz!A$135,\" - P5 I1\"),\"\")","v":""},{"$f":"IF(CONCATENATE($C$38,E$3)=Matriz!$J$207,CONCATENATE(Matriz!A$207,\" - P5 I1\"),\"\")","v":""},{"$f":"IF(CONCATENATE($C$38,E$3)=Matriz!$J$279,CONCATENATE(Matriz!A$279,\" - P5 I1\"),\"\")","v":""},{"$f":"IF(CONCATENATE($C$38,E$3)=Matriz!$J$351,CONCATENATE(Matriz!A$351,\" - P5 I1\"),\"\")","v":""},{"$f":"IF(CONCATENATE($C$38,E$3)=Matriz!$J$423,CONCATENATE(Matriz!A$423,\" - P5 I1\"),\"\")","v":""},{"$f":"IF(CONCATENATE($C$38,K$3)=Matriz!$J$63,CONCATENATE(Matriz!A$63,\" - P5 I2\"),\"\")","v":""},{"$f":"IF(CONCATENATE($C$38,K$3)=Matriz!$J$135,CONCATENATE(Matriz!A$135,\" - P5 I2\"),\"\")","v":""},{"$f":"IF(CONCATENATE($C$38,K$3)=Matriz!$J$207,CONCATENATE(Matriz!A$207,\" - P5 I2\"),\"\")","v":""},{"$f":"IF(CONCATENATE($C$38,K$3)=Matriz!$J$279,CONCATENATE(Matriz!A$279,\" - P5 I2\"),\"\")","v":""},{"$f":"IF(CONCATENATE($C$38,K$3)=Matriz!$J$351,CONCATENATE(Matriz!A$351,\" - P5 I2\"),\"\")","v":""},{"$f":"IF(CONCATENATE($C$38,K$3)=Matriz!$J$423,CONCATENATE(Matriz!A$423,\" - P5 I2\"),\"\")","v":""},{"$f":"IF(CONCATENATE($C$38,Q$3)=Matriz!$J$63,CONCATENATE(Matriz!A$63,\" - P5 I3\"),\"\")","v":""},{"$f":"IF(CONCATENATE($C$38,Q$3)=Matriz!$J$135,CONCATENATE(Matriz!A$135,\" - P5 I3\"),\"\")","v":""},{"$f":"IF(CONCATENATE($C$38,Q$3)=Matriz!$J$207,CONCATENATE(Matriz!A$207,\" - P5 I3\"),\"\")","v":""},{"$f":"IF(CONCATENATE($C$38,Q$3)=Matriz!$J$279,CONCATENATE(Matriz!A$279,\" - P5 I3\"),\"\")","v":""},{"$f":"IF(CONCATENATE($C$38,Q$3)=Matriz!$J$351,CONCATENATE(Matriz!A$351,\" - P5 I3\"),\"\")","v":""},null,{"$f":"IF(CONCATENATE($C$38,W$3)=Matriz!$J$63,CONCATENATE(Matriz!A$63,\" - P5 I4\"),\"\")","v":""},{"$f":"IF(CONCATENATE($C$38,W$3)=Matriz!$J$135,CONCATENATE(Matriz!A$135,\" - P5 I4\"),\"\")","v":""},{"$f":"IF(CONCATENATE($C$38,W$3)=Matriz!$J$207,CONCATENATE(Matriz!A$207,\" - P5 I4\"),\"\")","v":""},{"$f":"IF(CONCATENATE($C$38,W$3)=Matriz!$J$279,CONCATENATE(Matriz!A$279,\" - P5 I4\"),\"\")","v":""},{"$f":"IF(CONCATENATE($C$38,W$3)=Matriz!$J$351,CONCATENATE(Matriz!A$351,\" - P5 I4\"),\"\")","v":""},{"$f":"IF(CONCATENATE($C$38,W$3)=Matriz!$J$423,CONCATENATE(Matriz!A$423,\" - P5 I4\"),\"\")","v":""},{"$f":"IF(CONCATENATE($C$38,AC$3)=Matriz!$J$63,CONCATENATE(Matriz!A$63,\" - P5 I5\"),\"\")","v":""},{"$f":"IF(CONCATENATE($C$38,AC$3)=Matriz!$J$135,CONCATENATE(Matriz!A$135,\" - P5 I5\"),\"\")","v":""},{"$f":"IF(CONCATENATE($C$38,AC$3)=Matriz!$J$207,CONCATENATE(Matriz!A$207,\" - P5 I5\"),\"\")","v":""},{"$f":"IF(CONCATENATE($C$38,AC$3)=Matriz!$J$279,CONCATENATE(Matriz!A$279,\" - P5 I5\"),\"\")","v":"R31 - P5 I5"},{"$f":"IF(CONCATENATE($C$38,AC$3)=Matriz!$J$351,CONCATENATE(Matriz!A$351,\" - P5 I5\"),\"\")","v":""},{"$f":"IF(CONCATENATE($C$38,AC$3)=Matriz!$J$423,CONCATENATE(Matriz!A$423,\" - P5 I5\"),\"\")","v":""},{"$nulls":5},9,24,216]
[{"$nulls":4},{"$f":"IF(CONCATENATE($C$38,E$3)=Matriz!$J$72,CONCATENATE(Matriz!A$72,\" - P5 I1\"),\"\")","v":""},{"$f":"IF(CONCATENATE($C$38,E$3)=Matriz!$J$144,CONCATENATE(Matriz!A$144,\" - P5 I1\"),\"\")","v":""},{"$f":"IF(CONCATENATE($C$38,E$3)=Matriz!$J$216,CONCATENATE(Matriz!A$216,\" - P5 I1\"),\"\")","v":""},{"$f":"IF(CONCATENATE($C$38,E$3)=Matriz!$J$288,CONCATENATE(Matriz!A$288,\" - P5 I1\"),\"\")","v":""},{"$f":"IF(CONCATENATE($C$38,E$3)=Matriz!$J$360,CONCATENATE(Matriz!A$360,\" - P5 I1\"),\"\")","v":""},{"$f":"IF(CONCATENATE($C$38,E$3)=Matriz!$J$432,CONCATENATE(Matriz!A$432,\" - P5 I1\"),\"\")","v":""},{"$f":"IF(CONCATENATE($C$38,K$3)=Matriz!$J$72,CONCATENATE(Matriz!A$72,\" - P5 I2\"),\"\")","v":""},{"$f":"IF(CONCATENATE($C$38,K$3)=Matriz!$J$144,CONCATENATE(Matriz!A$144,\" - P5 I2\"),\"\")","v":""},{"$f":"IF(CONCATENATE($C$38,K$3)=Matriz!$J$216,CONCATENATE(Matriz!A$216,\" - P5 I2\"),\"\")","v":""},{"$f":"IF(CONCATENATE($C$38,K$3)=Matriz!$J$288,CONCATENATE(Matriz!A$288,\" - P5 I2\"),\"\")","v":""},{"$f":"IF(CONCATENATE($C$38,K$3)=Matriz!$J$360,CONCATENATE(Matriz!A$360,\" - P5 I2\"),\"\")","v":""},{"$f":"IF(CONCATENATE($C$38,K$3)=Matriz!$J$432,CONCATENATE(Matriz!A$432,\" - P5 I2\"),\"\")","v":""},{"$f":"IF(CONCATENATE($C$38,Q$3)=Matriz!$J$72,CONCATENATE(Matriz!A$72,\" - P5 I3\"),\"\")","v":""},{"$f":"IF(CONCATENATE($C$38,Q$3)=Matriz!$J$144,CONCATENATE(Matriz!A$144,\" - P5 I3\"),\"\")","v":""},{"$f":"IF(CONCATENATE($C$38,Q$3)=Matriz!$J$216,CONCATENATE(Matriz!A$216,\" - P5 I3\"),\"\")","v":""},{"$f":"IF(CONCATENATE($C$38,Q$3)=Matriz!$J$288,CONCATENATE(Matriz!A$288,\" - P5 I3\"),\"\")","v":""},{"$f":"IF(CONCATENATE($C$38,Q$3)=Matriz!$J$360,CONCATENATE(Matriz!A$360,\" - P5 I3\"),\"\")","v":""},null,{"$f":"IF(CONCATENATE($C$38,W$3)=Matriz!$J$72,CONCATENATE(Matriz!A$72,\" - P5 I4\"),\"\")","v":""},{"$f":"IF(CONCATENATE($C$38,W$3)=Matriz!$J$144,CONCATENATE(Matriz!A$144,\" - P5 I4\"),\"\")","v":""},{"$f":"IF(CONCATENATE($C$38,W$3)=Matriz!$J$216,CONCATENATE(Matriz!A$216,\" - P5 I4\"),\"\")","v":""},{"$f":"IF(CONCATENATE($C$38,W$3)=Matriz!$J$288,CONCATENATE(Matriz!A$288,\" - P5 I4\"),\"\")","v":""},{"$f":"IF(CONCATENATE($C$38,W$3)=Matriz!$J$360,CONCATENATE(Matriz!A$360,\" - P5 I4\"),\"\")","v":""},{"$f":"IF(CONCATENATE($C$38,W$3)=Matriz!$J$432,CONCATENATE(Matriz!A$432,\" - P5 I4\"),\"\")","v":""},{"$f":"IF(CONCATENATE($C$38,AC$3)=Matriz!$J$72,CONCATENATE(Matriz!A$72,\" - P5 I5\"),\"\")","v":""},{"$f":"IF(CONCATENATE($C$38,AC$3)=Matriz!$J$144,CONCATENATE(Matriz!A$144,\" - P5 I5\"),\"\")","v":""},{"$f":"IF(CONCATENATE($C$38,AC$3)=Matriz!$J$216,CONCATENATE(Matriz!A$216,\" - P5 I5\"),\"\")","v":""},{"$f":"IF(CONCATENATE($C$38,AC$3)=Matriz!$J$288,CONCATENATE(Matriz!A$288,\" - P5 I5\"),\"\")","v":""},{"$f":"IF(CONCATENATE($C$38,AC$3)=Matriz!$J$360,CONCATENATE(Matriz!A$360,\" - P5 I5\"),\"\")","v":""},{"$f":"IF(CONCATENATE($C$38,AC$3)=Matriz!$J$432,CONCATENATE(Matriz!A$432,\" - P5 I5\"),\"\")","v":""},{"$nulls":5},9,25,225]
[]
[]
[{"$nulls":35},"MATRIZ DE RIESGO INHERENTE"]
{"$rows_empty":7}
[{"$nulls":36},"Zona de Riesgo Baja"]
[]
[]
[{"$nulls":36},"Zona de Riesgo Moderada"]
[]
[]
[{"$nulls":36},"Zona de Riesgo Alta"]
[]
[]
[{"$nulls":36},"Zona de Riesgo Extrema"]

{"sheet":"Mapa Riesgo Residual","index":4,"n_rows":59,"n_cols":42,"rows_kept":59,"merged":[[1,2,1,33],[2,4,2,9],[2,10,2,15],[2,16,2,20],[2,22,2,26],[2,28,2,33],[3,2,3,3],[3,4,3,9],[3,10,3,15],[3,16,3,20],[3,22,3,26],[3,28,3,33],[4,2,4,3],[5,1,38,1],[6,2,11,2],[6,3,11,3],[14,2,19,2],[14,3,19,3],[22,2,27,2],[22,3,27,3],[30,2,32,2],[30,3,32,3],[35,2,37,2],[35,3,37,3],[41,35,46,38],[49,36,49,38],[52,36,52,38],[55,36,55,38],[58,36,58,38]]}
[]
[null,null,"IMPACTO"]
[{"$nulls":4},1,{"$nulls":5},2,{"$nulls":5},3,{"$nulls":5},4,{"$nulls":5},5]
[{"$nulls":4},"INSIGNIFICANTE",{"$nulls":5},"MENOR",{"$nulls":5},"MODERADO",{"$nulls":5},"MAYOR",{"$nulls":5},"CATASTRÓFICO"]
[]
[null,"PROBABILIDAD",null,null,{"$f":"IF(CONCATENATE(C$7,E$3)=Matriz!$BE$9,CONCATENATE(Matriz!A9,\" - P1 I1\"),\"\")","v":""},{"$f":"IF(CONCATENATE(C$7,E$3)=Matriz!$BE$81,CONCATENATE(Matriz!A81,\" - P1 I1\"),\"\")","v":""},{"$f":"IF(CONCATENATE(C$7,E$3)=Matriz!$BE$153,CONCATENATE(Matriz!A153,\" - P1 I1\"),\"\")","v":""},{"$f":"IF(CONCATENATE(C$7,E$3)=Matriz!$BE$225,CONCATENATE(Matriz!A225,\" - P1 I1\"),\"\")","v":""},{"$f":"IF(CONCATENATE(C$7,E$3)=Matriz!$BE$297,CONCATENATE(Matriz!A297,\" - P1 I1\"),\"\")","v":""},{"$f":"IF(CONCATENATE(C$7,E$3)=Matriz!$BE$369,CONCATENATE(Matriz!A369,\" - P1 I1\"),\"\")","v":""},{"$f":"IF(CONCATENATE(C$7,K$3)=Matriz!$BE$9,CONCATENATE(Matriz!A9,\" - P1 I2\"),\"\")","v":""},{"$f":"IF(CONCATENATE(C$7,K$3)=Matriz!$BE$81,CONCATENATE(Matriz!A81,\" - P1 I2\"),\"\")","v":""},{"$f":"IF(CONCATENATE(C$7,K$3)=Matriz!$BE$153,CONCATENATE(Matriz!A153,\" - P1 I2\"),\"\")","v":""},{"$f":"IF(CONCATENATE(C$7,K$3)=Matriz!$BE$225,CONCATENATE(Matriz!A225,\" - P1 I2\"),\"\")","v":""},{"$f":"IF(CONCATENATE(C$7,K$3)=Matriz!$BE$297,CONCATENATE(Matriz!A297,\" - P1 I2\"),\"\")","v":""},{"$f":"IF(CONCATENATE(C$7,K$3)=Matriz!$BE$369,CONCATENATE(Matriz!A369,\" - P1 I2\"),\"\")","v":""},{"$f":"IF(CONCATENATE(C$7,Q$3)=Matriz!$BE$9,CONCATENATE(Matriz!A9,\" - P1 I3\"),\"\")","v":""},{"$f":"IF(CONCATENATE(C$7,Q$3)=Matriz!$BE$81,CONCATENATE(Matriz!A81,\" - P1 I3\"),\"\")","v":""},{"$f":"IF(CONCATENATE(C$7,Q$3)=Matriz!$BE$153,CONCATENATE(Matriz!A153,\" - P1 I3\"),\"\")","v":""},{"$f":"IF(CONCATENATE(C$7,Q$3)=Matriz!$BE$225,CONCATENATE(Matriz!A225,\" - P1 I3\"),\"\")","v":""},{"$f":"IF(CONCATENATE(C$7,Q$3)=Matriz!$BE$297,CONCATENATE(Matriz!A297,\" - P1 I3\"),\"\")","v":""},{"$f":"IF(CONCATENATE(C$7,Q$3)=Matriz!$BE$369,CONCATENATE(Matriz!A369,\" - P1 I3\"),\"\")","v":""},{"$f":"IF(CONCATENATE(C$7,W$3)=Matriz!$BE$9,CONCATENATE(Matriz!A9,\" - P1 I4\"),\"\")","v":""},{"$f":"IF(CONCATENATE(C$7,W$3)=Matriz!$BE$81,CONCATENATE(Matriz!A81,\" - P1 I4\"),\"\")","v":""},{"$f":"IF(CONCATENATE(C$7,W$3)=Matriz!$BE$153,CONCATENATE(Matriz!A153,\" - P1 I4\"),\"\")","v":""},{"$f":"IF(CONCATENATE(C$7,W$3)=Matriz!$BE$225,CONCATENATE(Matriz!A225,\" - P1 I4\"),\"\")","v":"R25 - P1 I4"},null,null,{"$f":"IF(CONCATENATE(C$7,AC$3)=Matriz!$BE$9,CONCATENATE(Matriz!A9,\" - P1 I5\"),\"\")","v":""},{"$f":"IF(CONCATENATE(C$7,AC$3)=Matriz!$BE$81,CONCATENATE(Matriz!A81,\" - P1 I5\"),\"\")","v":""},{"$f":"IF(CONCATENATE(C$7,AC$3)=Matriz!$BE$153,CONCATENATE(Matriz!A153,\" - P1 I5\"),\"\")","v":""},{"$f":"IF(CONCATENATE(C$7,AC$3)=Matriz!$BE$225,CONCATENATE(Matriz!A225,\" - P1 I5\"),\"\")","v":""}]
[null,null,1,"RARO",{"$f":"IF(CONCATENATE(C$7,E$3)=Matriz!$BE$18,CONCATENATE(Matriz!A18,\" - P1 I1\"),\"\")","v":""},{"$f":"IF(CONCATENATE(C$7,E$3)=Matriz!$BE$90,CONCATENATE(Matriz!A90,\" - P1 I1\"),\"\")","v":""},{"$f":"IF(CONCATENATE(C$7,E$3)=Matriz!$BE$162,CONCATENATE(Matriz!A162,\" - P1 I1\"),\"\")","v":""},{"$f":"IF(CONCATENATE(C$7,E$3)=Matriz!$BE$234,CONCATENATE(Matriz!A234,\" - P1 I1\"),\"\")","v":""},{"$f":"IF(CONCATENATE(C$7,E$3)=Matriz!$BE$306,CONCATENATE(Matriz!A306,\" - P1 I1\"),\"\")","v":""},{"$f":"IF(CONCATENATE(C$7,E$3)=Matriz!$BE$378,CONCATENATE(Matriz!A378,\" - P1 I1\"),\"\")","v":""},{"$f":"IF(CONCATENATE(C$7,K$3)=Matriz!$BE$18,CONCATENATE(Matriz!A18,\" - P1 I2\"),\"\")","v":""},{"$f":"IF(CONCATENATE(C$7,K$3)=Matriz!$BE$90,CONCATENATE(Matriz!A90,\" - P1 I2\"),\"\")","v":""},{"$f":"IF(CONCATENATE(C$7,K$3)=Matriz!$BE$162,CONCATENATE(Matriz!A162,\" - P1 I2\"),\"\")","v":""},{"$f":"IF(CONCATENATE(C$7,K$3)=Matriz!$BE$234,CONCATENATE(Matriz!A234,\" - P1 I2\"),\"\")","v":""},{"$f":"IF(CONCATENATE(C$7,K$3)=Matriz!$BE$306,CONCATENATE(Matriz!A306,\" - P1 I2\"),\"\")","v":""},{"$f":"IF(CONCATENATE(C$7,K$3)=Matriz!$BE$378,CONCATENATE(Matriz!A378,\" - P1 I2\"),\"\")","v":""},{"$f":"IF(CONCATENATE(C$7,Q$3)=Matriz!$BE$18,CONCATENATE(Matriz!A18,\" - P1 I3\"),\"\")","v":""},{"$f":"IF(CONCATENATE(C$7,Q$3)=Matriz!$BE$90,CONCATENATE(Matriz!A90,\" - P1 I3\"),\"\")","v":""},{"$f":"IF(CONCATENATE(C$7,Q$3)=Matriz!$BE$162,CONCATENATE(Matriz!A162,\" - P1 I3\"),\"\")","v":""},{"$f":"IF(CONCATENATE(C$7,Q$3)=Matriz!$BE$234,CONCATENATE(Matriz!A234,\" - P1 I3\"),\"\")","v":""},{"$f":"IF(CONCATENATE(C$7,Q$3)=Matriz!$BE$306,CONCATENATE(Matriz!A306,\" - P1 I3\"),\"\")","v":""},{"$f":"IF(CONCATENATE(C$7,Q$3)=Matriz!$BE$378,CONCATENATE(Matriz!A378,\" - P1 I3\"),\"\")","v":""},{"$f":"IF(CONCATENATE(C$7,W$3)=Matriz!$BE$18,CONCATENATE(Matriz!A18,\" - P1 I4\"),\"\")","v":""},{"$f":"IF(CONCATENATE(C$7,W$3)=Matriz!$BE$90,CONCATENATE(Matriz!A90,\" - P1 I4\"),\"\")","v":"R10 - P1 I4"},{"$f":"IF(CONCATENATE(C$7,W$3)=Matriz!$BE$162,CONCATENATE(Matriz!A162,\" - P1 I4\"),\"\")","v":""},{"$f":"IF(CONCATENATE(C$7,W$3)=Matriz!$BE$234,CONCATENATE(Matriz!A234,\" - P1 I4\"),\"\")","v":""},null,null,{"$f":"IF(CONCATENATE(C$7,AC$3)=Matriz!$BE$18,CONCATENATE(Matriz!A18,\" - P1 I5\"),\"\")","v":""},{"$f":"IF(CONCATENATE(C$7,AC$3)=Matriz!$BE$90,CONCATENATE(Matriz!A90,\" - P1 I5\"),\"\")","v":""},{"$f":"IF(CONCATENATE(C$7,AC$3)=Matriz!$BE$162,CONCATENATE(Matriz!A162,\" - P1 I5\"),\"\")","v":""}]
[{"$nulls":4},{"$f":"IF(CONCATENATE(C$7,E$3)=Matriz!$BE$27,CONCATENATE(Matriz!A27,\" - P1 I1\"),\"\")","v":""},{"$f":"IF(CONCATENATE(C$7,E$3)=Matriz!$BE$99,CONCATENATE(Matriz!A99,\" - P1 I1\"),\"\")","v":""},{"$f":"IF(CONCATENATE(C$7,E$3)=Matriz!$BE$171,CONCATENATE(Matriz!A171,\" - P1 I1\"),\"\")","v":""},{"$f":"IF(CONCATENATE(C$7,E$3)=Matriz!$BE$243,CONCATENATE(Matriz!A243,\" - P1 I1\"),\"\")","v":""},{"$f":"IF(CONCATENATE(C$7,E$3)=Matriz!$BE$315,CONCATENATE(Matriz!A315,\" - P1 I1\"),\"\")","v":""},{"$f":"IF(CONCATENATE(C$7,E$3)=Matriz!$BE$387,CONCATENATE(Matriz!A387,\" - P1 I1\"),\"\")","v":""},{"$f":"IF(CONCATENATE(C$7,K$3)=Matriz!$BE$27,CONCATENATE(Matriz!A27,\" - P1 I2\"),\"\")","v":""},{"$f":"IF(CONCATENATE(C$7,K$3)=Matriz!$BE$99,CONCATENATE(Matriz!A99,\" - P1 I2\"),\"\")","v":""},{"$f":"IF(CONCATENATE(C$7,K$3)=Matriz!$BE$171,CONCATENATE(Matriz!A171,\" - P1 I2\"),\"\")","v":""},{"$f":"IF(CONCATENATE(C$7,K$3)=Matriz!$BE$243,CONCATENATE(Matriz!A243,\" - P1 I2\"),\"\")","v":""},{"$f":"IF(CONCATENATE(C$7,K$3)=Matriz!$BE$315,CONCATENATE(Matriz!A315,\" - P1 I2\"),\"\")","v":""},{"$f":"IF(CONCATENATE(C$7,K$3)=Matriz!$BE$387,CONCATENATE(Matriz!A387,\" - P1 I2\"),\"\")","v":""},{"$f":"IF(CONCATENATE(C$7,Q$3)=Matriz!$BE$27,CONCATENATE(Matriz!A27,\" - P1 I3\"),\"\")","v":""},{"$f":"IF(CONCATENATE(C$7,Q$3)=Matriz!$BE$99,CONCATENATE(Matriz!A99,\" - P1 I3\"),\"\")","v":""},{"$f":"IF(CONCATENATE(C$7,Q$3)=Matriz!$BE$171,CONCATENATE(Matriz!A171,\" - P1 I3\"),\"\")","v":""},{"$f":"IF(CONCATENATE(C$7,Q$3)=Matriz!$BE$243,CONCATENATE(Matriz!A243,\" - P1 I3\"),\"\")","v":""},{"$f":"IF(CONCATENATE(C$7,Q$3)=Matriz!$BE$315,CONCATENATE(Matriz!A315,\" - P1 I3\"),\"\")","v":""},{"$f":"IF(CONCATENATE(C$7,Q$3)=Matriz!$BE$387,CONCATENATE(Matriz!A387,\" - P1 I3\"),\"\")","v":""},{"$f":"IF(CONCATENATE(C$7,W$3)=Matriz!$BE$27,CONCATENATE(Matriz!A27,\" - P1 I4\"),\"\")","v":"R3 - P1 I4"},{"$f":"IF(CONCATENATE(C$7,W$3)=Matriz!$BE$99,CONCATENATE(Matriz!A99,\" - P1 I4\"),\"\")","v":""},{"$f":"IF(CONCATENATE(C$7,W$3)=Matriz!$BE$171,CONCATENATE(Matriz!A171,\" - P1 I4\"),\"\")","v":""},{"$f":"IF(CONCATENATE(C$7,W$3)=Matriz!$BE$243,CONCATENATE(Matriz!A243,\" - P1 I4\"),\"\")","v":""},null,null,{"$f":"IF(CONCATENATE(C$7,AC$3)=Matriz!$BE$27,CONCATENATE(Matriz!A27,\" - P1 I5\"),\"\")","v":""},{"$f":"IF(CONCATENATE(C$7,AC$3)=Matriz!$BE$99,CONCATENATE(Matriz!A99,\" - P1 I5\"),\"\")","v":""},{"$f":"IF(CONCATENATE(C$7,AC$3)=Matriz!$BE$171,CONCATENATE(Matriz!A171,\" - P1 I5\"),\"\")","v":""}]
[{"$nulls":4},{"$f":"IF(CONCATENATE(C$7,E$3)=Matriz!$BE$36,CONCATENATE(Matriz!A36,\" - P1 I1\"),\"\")","v":""},{"$f":"IF(CONCATENATE(C$7,E$3)=Matriz!$BE$108,CONCATENATE(Matriz!A108,\" - P1 I1\"),\"\")","v":""},{"$f":"IF(CONCATENATE(C$7,E$3)=Matriz!$BE$180,CONCATENATE(Matriz!A180,\" - P1 I1\"),\"\")","v":""},{"$f":"IF(CONCATENATE(C$7,E$3)=Matriz!$BE$252,CONCATENATE(Matriz!A252,\" - P1 I1\"),\"\")","v":""},{"$f":"IF(CONCATENATE(C$7,E$3)=Matriz!$BE$324,CONCATENATE(Matriz!A324,\" - P1 I1\"),\"\")","v":""},{"$f":"IF(CONCATENATE(C$7,E$3)=Matriz!$BE$396,CONCATENATE(Matriz!A396,\" - P1 I1\"),\"\")","v":""},{"$f":"IF(CONCATENATE(C$7,K$3)=Matriz!$BE$36,CONCATENATE(Matriz!A36,\" - P1 I2\"),\"\")","v":""},{"$f":"IF(CONCATENATE(C$7,K$3)=Matriz!$BE$108,CONCATENATE(Matriz!A108,\" - P1 I2\"),\"\")","v":""},{"$f":"IF(CONCATENATE(C$7,K$3)=Matriz!$BE$180,CONCATENATE(Matriz!A180,\" - P1 I2\"),\"\")","v":""},{"$f":"IF(CONCATENATE(C$7,K$3)=Matriz!$BE$252,CONCATENATE(Matriz!A252,\" - P1 I2\"),\"\")","v":""},{"$f":"IF(CONCATENATE(C$7,K$3)=Matriz!$BE$324,CONCATENATE(Matriz!A324,\" - P1 I2\"),\"\")","v":""},{"$f":"IF(CONCATENATE(C$7,K$3)=Matriz!$BE$396,CONCATENATE(Matriz!A396,\" - P1 I2\"),\"\")","v":""},{"$f":"IF(CONCATENATE(C$7,Q$3)=Matriz!$BE$36,CONCATENATE(Matriz!A36,\" - P1 I3\"),\"\")","v":""},{"$f":"IF(CONCATENATE(C$7,Q$3)=Matriz!$BE$108,CONCATENATE(Matriz!A108,\" - P1 I3\"),\"\")","v":""},{"$f":"IF(CONCATENATE(C$7,Q$3)=Matriz!$BE$180,CONCATENATE(Matriz!A180,\" - P1 I3\"),\"\")","v":"R20 - P1 I3"},{"$f":"IF(CONCATENATE(C$7,Q$3)=Matriz!$BE$252,CONCATENATE(Matriz!A252,\" - P1 I3\"),\"\")","v":""},{"$f":"IF(CONCATENATE(C$7,Q$3)=Matriz!$BE$324,CONCATENATE(Matriz!A324,\" - P1 I3\"),\"\")","v":""},{"$f":"IF(CONCATENATE(C$7,Q$3)=Matriz!$BE$396,CONCATENATE(Matriz!A396,\" - P1 I3\"),\"\")","v":""},{"$f":"IF(CONCATENATE(C$7,W$3)=Matriz!$BE$36,CONCATENATE(Matriz!A36,\" - P1 I4\"),\"\")","v":"R4 - P1 I4"},{"$f":"IF(CONCATENATE(C$7,W$3)=Matriz!$BE$108,CONCATENATE(Matriz!A108,\" - P1 I4\"),\"\")","v":""},{"$f":"IF(CONCATENATE(C$7,W$3)=Matriz!$BE$180,CONCATENATE(Matriz!A180,\" - P1 I4\"),\"\")","v":""},{"$f":"IF(CONCATENATE(C$7,W$3)=Matriz!$BE$252,CONCATENATE(Matriz!A252,\" - P1 I4\"),\"\")","v":""},null,null,{"$f":"IF(CONCATENATE(C$7,AC$3)=Matriz!$BE$36,CONCATENATE(Matriz!A36,\" - P1 I5\"),\"\")","v":""},{"$f":"IF(CONCATENATE(C$7,AC$3)=Matriz!$BE$108,CONCATENATE(Matriz!A108,\" - P1 I5\"),\"\")","v":""},{"$f":"IF(CONCATENATE(C$7,AC$3)=Matriz!$BE$180,CONCATENATE(Matriz!A180,\" - P1 I5\"),\"\")","v":""}]
[{"$nulls":4},{"$f":"IF(CONCATENATE(C$7,E$3)=Matriz!$BE$45,CONCATENATE(Matriz!A45,\" - P1 I1\"),\"\")","v":""},{"$f":"IF(CONCATENATE(C$7,E$3)=Matriz!$BE$117,CONCATENATE(Matriz!A117,\" - P1 I1\"),\"\")","v":""},{"$f":"IF(CONCATENATE(C$7,E$3)=Matriz!$BE$189,CONCATENATE(Matriz!A189,\" - P1 I1\"),\"\")","v":""},{"$f":"IF(CONCATENATE(C$7,E$3)=Matriz!$BE$261,CONCATENATE(Matriz!A261,\" - P1 I1\"),\"\")","v":""},{"$f":"IF(CONCATENATE(C$7,E$3)=Matriz!$BE$333,CONCATENATE(Matriz!A333,\" - P1 I1\"),\"\")","v":""},{"$f":"IF(CONCATENATE(C$7,E$3)=Matriz!$BE$405,CONCATENATE(Matriz!A405,\" - P1 I1\"),\"\")","v":""},{"$f":"IF(CONCATENATE(C$7,K$3)=Matriz!$BE$45,CONCATENATE(Matriz!A45,\" - P1 I2\"),\"\")","v":""},{"$f":"IF(CONCATENATE(C$7,K$3)=Matriz!$BE$117,CONCATENATE(Matriz!A117,\" - P1 I2\"),\"\")","v":""},{"$f":"IF(CONCATENATE(C$7,K$3)=Matriz!$BE$189,CONCATENATE(Matriz!A189,\" - P1 I2\"),\"\")","v":""},{"$f":"IF(CONCATENATE(C$7,K$3)=Matriz!$BE$261,CONCATENATE(Matriz!A261,\" - P1 I2\"),\"\")","v":""},{"$f":"IF(CONCATENATE(C$7,K$3)=Matriz!$BE$333,CONCATENATE(Matriz!A333,\" - P1 I2\"),\"\")","v":""},{"$f":"IF(CONCATENATE(C$7,K$3)=Matriz!$BE$405,CONCATENATE(Matriz!A405,\" - P1 I2\"),\"\")","v":""},{"$f":"IF(CONCATENATE(C$7,Q$3)=Matriz!$BE$45,CONCATENATE(Matriz!A45,\" - P1 I3\"),\"\")","v":""},{"$f":"IF(CONCATENATE(C$7,Q$3)=Matriz!$BE$117,CONCATENATE(Matriz!A117,\" - P1 I3\"),\"\")","v":""},{"$f":"IF(CONCATENATE(C$7,Q$3)=Matriz!$BE$189,CONCATENATE(Matriz!A189,\" - P1 I3\"),\"\")","v":""},{"$f":"IF(CONCATENATE(C$7,Q$3)=Matriz!$BE$261,CONCATENATE(Matriz!A261,\" - P1 I3\"),\"\")","v":""},{"$f":"IF(CONCATENATE(C$7,Q$3)=Matriz!$BE$333,CONCATENATE(Matriz!A333,\" - P1 I3\"),\"\")","v":""},{"$f":"IF(CONCATENATE(C$7,Q$3)=Matriz!$BE$405,CONCATENATE(Matriz!A405,\" - P1 I3\"),\"\")","v":""},{"$f":"IF(CONCATENATE(C$7,W$3)=Matriz!$BE$45,CONCATENATE(Matriz!A45,\" - P1 I4\"),\"\")","v":""},{"$f":"IF(CONCATENATE(C$7,W$3)=Matriz!$BE$117,CONCATENATE(Matriz!A117,\" - P1 I4\"),\"\")","v":""},{"$f":"IF(CONCATENATE(C$7,W$3)=Matriz!$BE$189,CONCATENATE(Matriz!A189,\" - P1 I4\"),\"\")","v":""},{"$f":"IF(CONCATENATE(C$7,W$3)=Matriz!$BE$261,CONCATENATE(Matriz!A261,\" - P1 I4\"),\"\")","v":""},null,null,{"$f":"IF(CONCATENATE(C$7,AC$3)=Matriz!$BE$45,CONCATENATE(Matriz!A45,\" - P1 I5\"),\"\")","v":""},{"$f":"IF(CONCATENATE(C$7,AC$3)=Matriz!$BE$117,CONCATENATE(Matriz!A117,\" - P1 I5\"),\"\")","v":""},{"$f":"IF(CONCATENATE(C$7,AC$3)=Matriz!$BE$189,CONCATENATE(Matriz!A189,\" - P1 I5\"),\"\")","v":""}]
[{"$nulls":4},{"$f":"IF(CONCATENATE(C$7,E$3)=Matriz!$BE$54,CONCATENATE(Matriz!A54,\" - P1 I1\"),\"\")","v":""},{"$f":"IF(CONCATENATE(C$7,E$3)=Matriz!$BE$126,CONCATENATE(Matriz!A126,\" - P1 I1\"),\"\")","v":""},{"$f":"IF(CONCATENATE(C$7,E$3)=Matriz!$BE$198,CONCATENATE(Matriz!A198,\" - P1 I1\"),\"\")","v":""},{"$f":"IF(CONCATENATE(C$7,E$3)=Matriz!$BE$270,CONCATENATE(Matriz!A270,\" - P1 I1\"),\"\")","v":""},{"$f":"IF(CONCATENATE(C$7,E$3)=Matriz!$BE$342,CONCATENATE(Matriz!A342,\" - P1 I1\"),\"\")","v":""},{"$f":"IF(CONCATENATE(C$7,E$3)=Matriz!$BE$414,CONCATENATE(Matriz!A414,\" - P1 I1\"),\"\")","v":""},{"$f":"IF(CONCATENATE(C$7,K$3)=Matriz!$BE$54,CONCATENATE(Matriz!A54,\" - P1 I2\"),\"\")","v":""},{"$f":"IF(CONCATENATE(C$7,K$3)=Matriz!$BE$126,CONCATENATE(Matriz!A126,\" - P1 I2\"),\"\")","v":""},{"$f":"IF(CONCATENATE(C$7,K$3)=Matriz!$BE$198,CONCATENATE(Matriz!A198,\" - P1 I2\"),\"\")","v":""},{"$f":"IF(CONCATENATE(C$7,K$3)=Matriz!$BE$270,CONCATENATE(Matriz!A270,\" - P1 I2\"),\"\")","v":""},{"$f":"IF(CONCATENATE(C$7,K$3)=Matriz!$BE$342,CONCATENATE(Matriz!A342,\" - P1 I2\"),\"\")","v":""},{"$f":"IF(CONCATENATE(C$7,K$3)=Matriz!$BE$414,CONCATENATE(Matriz!A414,\" - P1 I2\"),\"\")","v":""},{"$f":"IF(CONCATENATE(C$7,Q$3)=Matriz!$BE$54,CONCATENATE(Matriz!A54,\" - P1 I3\"),\"\")","v":""},{"$f":"IF(CONCATENATE(C$7,Q$3)=Matriz!$BE$126,CONCATENATE(Matriz!A126,\" - P1 I3\"),\"\")","v":""},{"$f":"IF(CONCATENATE(C$7,Q$3)=Matriz!$BE$198,CONCATENATE(Matriz!A198,\" - P1 I3\"),\"\")","v":""},{"$f":"IF(CONCATENATE(C$7,Q$3)=Matriz!$BE$270,CONCATENATE(Matriz!A270,\" - P1 I3\"),\"\")","v":""},{"$f":"IF(CONCATENATE(C$7,Q$3)=Matriz!$BE$342,CONCATENATE(Matriz!A342,\" - P1 I3\"),\"\")","v":""},{"$f":"IF(CONCATENATE(C$7,Q$3)=Matriz!$BE$414,CONCATENATE(Matriz!A414,\" - P1 I3\"),\"\")","v":""},{"$f":"IF(CONCATENATE(C$7,W$3)=Matriz!$BE$54,CONCATENATE(Matriz!A54,\" - P1 I4\"),\"\")","v":""},{"$f":"IF(CONCATENATE(C$7,W$3)=Matriz!$BE$126,CONCATENATE(Matriz!A126,\" - P1 I4\"),\"\")","v":""},{"$f":"IF(CONCATENATE(C$7,W$3)=Matriz!$BE$198,CONCATENATE(Matriz!A198,\" - P1 I4\"),\"\")","v":""},{"$f":"IF(CONCATENATE(C$7,W$3)=Matriz!$BE$270,CONCATENATE(Matriz!A270,\" - P1 I4\"),\"\")","v":""},null,null,{"$f":"IF(CONCATENATE(C$7,AC$3)=Matriz!$BE$54,CONCATENATE(Matriz!A54,\" - P1 I5\"),\"\")","v":""},{"$f":"IF(CONCATENATE(C$7,AC$3)=Matriz!$BE$126,CONCATENATE(Matriz!A126,\" - P1 I5\"),\"\")","v":""},{"$f":"IF(CONCATENATE(C$7,AC$3)=Matriz!$BE$198,CONCATENATE(Matriz!A198,\" - P1 I5\"),\"\")","v":"R22 - P1 I5"}]
[{"$nulls":4},{"$f":"IF(CONCATENATE(C$7,E$3)=Matriz!$BE$63,CONCATENATE(Matriz!A63,\" - P1 I1\"),\"\")","v":""},{"$f":"IF(CONCATENATE(C$7,E$3)=Matriz!$BE$135,CONCATENATE(Matriz!A135,\" - P1 I1\"),\"\")","v":""},{"$f":"IF(CONCATENATE(C$7,E$3)=Matriz!$BE$207,CONCATENATE(Matriz!A207,\" - P1 I1\"),\"\")","v":""},{"$f":"IF(CONCATENATE(C$7,E$3)=Matriz!$BE$279,CONCATENATE(Matriz!A279,\" - P1 I1\"),\"\")","v":""},{"$f":"IF(CONCATENATE(C$7,E$3)=Matriz!$BE$351,CONCATENATE(Matriz!A351,\" - P1 I1\"),\"\")","v":""},{"$f":"IF(CONCATENATE(C$7,E$3)=Matriz!$BE$423,CONCATENATE(Matriz!A423,\" - P1 I1\"),\"\")","v":""},{"$f":"IF(CONCATENATE(C$7,K$3)=Matriz!$BE$63,CONCATENATE(Matriz!A63,\" - P1 I2\"),\"\")","v":""},{"$f":"IF(CONCATENATE(C$7,K$3)=Matriz!$BE$135,CONCATENATE(Matriz!A135,\" - P1 I2\"),\"\")","v":""},{"$f":"IF(CONCATENATE(C$7,K$3)=Matriz!$BE$207,CONCATENATE(Matriz!A207,\" - P1 I2\"),\"\")","v":""},{"$f":"IF(CONCATENATE(C$7,K$3)=Matriz!$BE$279,CONCATENATE(Matriz!A279,\" - P1 I2\"),\"\")","v":""},{"$f":"IF(CONCATENATE(C$7,K$3)=Matriz!$BE$351,CONCATENATE(Matriz!A351,\" - P1 I2\"),\"\")","v":""},{"$f":"IF(CONCATENATE(C$7,K$3)=Matriz!$BE$423,CONCATENATE(Matriz!A423,\" - P1 I2\"),\"\")","v":""},{"$f":"IF(CONCATENATE(C$7,Q$3)=Matriz!$BE$63,CONCATENATE(Matriz!A63,\" - P1 I3\"),\"\")","v":""},{"$f":"IF(CONCATENATE(C$7,Q$3)=Matriz!$BE$135,CONCATENATE(Matriz!A135,\" - P1 I3\"),\"\")","v":""},{"$f":"IF(CONCATENATE(C$7,Q$3)=Matriz!$BE$207,CONCATENATE(Matriz!A207,\" - P1 I3\"),\"\")","v":""},{"$f":"IF(CONCATENATE(C$7,Q$3)=Matriz!$BE$279,CONCATENATE(Matriz!A279,\" - P1 I3\"),\"\")","v":""},{"$f":"IF(CONCATENATE(C$7,Q$3)=Matriz!$BE$351,CONCATENATE(Matriz!A351,\" - P1 I3\"),\"\")","v":""},{"$f":"IF(CONCATENATE(C$7,Q$3)=Matriz!$BE$423,CONCATENATE(Matriz!A423,\" - P1 I3\"),\"\")","v":""},{"$f":"IF(CONCATENATE(C$7,W$3)=Matriz!$BE$63,CONCATENATE(Matriz!A63,\" - P1 I4\"),\"\")","v":"R7 - P1 I4"},{"$f":"IF(CONCATENATE(C$7,W$3)=Matriz!$BE$135,CONCATENATE(Matriz!A135,\" - P1 I4\"),\"\")","v":""},{"$f":"IF(CONCATENATE(C$7,W$3)=Matriz!$BE$207,CONCATENATE(Matriz!A207,\" - P1 I4\"),\"\")","v":"R23 - P1 I4"},{"$f":"IF(CONCATENATE(C$7,W$3)=Matriz!$BE$279,CONCATENATE(Matriz!A279,\" - P1 I4\"),\"\")","v":""},null,null,{"$f":"IF(CONCATENATE(C$7,AC$3)=Matriz!$BE$63,CONCATENATE(Matriz!A63,\" - P1 I5\"),\"\")","v":""},{"$f":"IF(CONCATENATE(C$7,AC$3)=Matriz!$BE$135,CONCATENATE(Matriz!A135,\" - P1 I5\"),\"\")","v":""},{"$f":"IF(CONCATENATE(C$7,AC$3)=Matriz!$BE$207,CONCATENATE(Matriz!A207,\" - P1 I5\"),\"\")","v":""}]
[{"$nulls":4},{"$f":"IF(CONCATENATE(C$7,E$3)=Matriz!$BE$72,CONCATENATE(Matriz!A72,\" - P1 I1\"),\"\")","v":""},{"$f":"IF(CONCATENATE(C$7,E$3)=Matriz!$BE$144,CONCATENATE(Matriz!A144,\" - P1 I1\"),\"\")","v":""},{"$f":"IF(CONCATENATE(C$7,E$3)=Matriz!$BE$216,CONCATENATE(Matriz!A216,\" - P1 I1\"),\"\")","v":""},{"$f":"IF(CONCATENATE(C$7,E$3)=Matriz!$BE$288,CONCATENATE(Matriz!A288,\" - P1 I1\"),\"\")","v":""},{"$f":"IF(CONCATENATE(C$7,E$3)=Matriz!$BE$360,CONCATENATE(Matriz!A360,\" - P1 I1\"),\"\")","v":""},{"$f":"IF(CONCATENATE(C$7,E$3)=Matriz!$BE$432,CONCATENATE(Matriz!A432,\" - P1 I1\"),\"\")","v":""},{"$f":"IF(CONCATENATE(C$7,K$3)=Matriz!$BE$72,CONCATENATE(Matriz!A72,\" - P1 I2\"),\"\")","v":""},{"$f":"IF(CONCATENATE(C$7,K$3)=Matriz!$BE$144,CONCATENATE(Matriz!A144,\" - P1 I2\"),\"\")","v":""},{"$f":"IF(CONCATENATE(C$7,K$3)=Matriz!$BE$216,CONCATENATE(Matriz!A216,\" - P1 I2\"),\"\")","v":""},{"$f":"IF(CONCATENATE(C$7,K$3)=Matriz!$BE$288,CONCATENATE(Matriz!A288,\" - P1 I2\"),\"\")","v":""},{"$f":"IF(CONCATENATE(C$7,K$3)=Matriz!$BE$360,CONCATENATE(Matriz!A360,\" - P1 I2\"),\"\")","v":""},{"$f":"IF(CONCATENATE(C$7,K$3)=Matriz!$BE$432,CONCATENATE(Matriz!A432,\" - P1 I2\"),\"\")","v":""},{"$f":"IF(CONCATENATE(C$7,Q$3)=Matriz!$BE$72,CONCATENATE(Matriz!A72,\" - P1 I3\"),\"\")","v":""},{"$f":"IF(CONCATENATE(C$7,Q$3)=Matriz!$BE$144,CONCATENATE(Matriz!A144,\" - P1 I3\"),\"\")","v":""},{"$f":"IF(CONCATENATE(C$7,Q$3)=Matriz!$BE$216,CONCATENATE(Matriz!A216,\" - P1 I3\"),\"\")","v":""},{"$f":"IF(CONCATENATE(C$7,Q$3)=Matriz!$BE$288,CONCATENATE(Matriz!A288,\" - P1 I3\"),\"\")","v":""},{"$f":"IF(CONCATENATE(C$7,Q$3)=Matriz!$BE$360,CONCATENATE(Matriz!A360,\" - P1 I3\"),\"\")","v":""},{"$f":"IF(CONCATENATE(C$7,Q$3)=Matriz!$BE$432,CONCATENATE(Matriz!A432,\" - P1 I3\"),\"\")","v":""},{"$f":"IF(CONCATENATE(C$7,W$3)=Matriz!$BE$72,CONCATENATE(Matriz!A72,\" - P1 I4\"),\"\")","v":""},{"$f":"IF(CONCATENATE(C$7,W$3)=Matriz!$BE$144,CONCATENATE(Matriz!A144,\" - P1 I4\"),\"\")","v":""},{"$f":"IF(CONCATENATE(C$7,W$3)=Matriz!$BE$216,CONCATENATE(Matriz!A216,\" - P1 I4\"),\"\")","v":""},{"$f":"IF(CONCATENATE(C$7,W$3)=Matriz!$BE$288,CONCATENATE(Matriz!A288,\" - P1 I4\"),\"\")","v":""},null,null,{"$f":"IF(CONCATENATE(C$7,AC$3)=Matriz!$BE$72,CONCATENATE(Matriz!A72,\" - P1 I5\"),\"\")","v":"R8 - P1 I5"},{"$f":"IF(CONCATENATE(C$7,AC$3)=Matriz!$BE$144,CONCATENATE(Matriz!A144,\" - P1 I5\"),\"\")","v":""},{"$f":"IF(CONCATENATE(C$7,AC$3)=Matriz!$BE$216,CONCATENATE(Matriz!A216,\" - P1 I5\"),\"\")","v":"R24 - P1 I5"}]
[{"$nulls":4},{"$f":"IF(CONCATENATE(C$15,E$3)=Matriz!$BE$9,CONCATENATE(Matriz!A9,\" - P2 I1\"),\"\")","v":""},{"$f":"IF(CONCATENATE(C$15,E$3)=Matriz!$BE$81,CONCATENATE(Matriz!A81,\" - P2 I1\"),\"\")","v":""},{"$f":"IF(CONCATENATE(C$15,E$3)=Matriz!$BE$153,CONCATENATE(Matriz!A153,\" - P2 I1\"),\"\")","v":""},{"$f":"IF(CONCATENATE(C$15,E$3)=Matriz!$BE$225,CONCATENATE(Matriz!A225,\" - P2 I1\"),\"\")","v":""},{"$f":"IF(CONCATENATE(C$15,E$3)=Matriz!$BE$297,CONCATENATE(Matriz!A297,\" - P2 I1\"),\"\")","v":""},null,{"$f":"IF(CONCATENATE(C$15,K$3)=Matriz!$BE$9,CONCATENATE(Matriz!A9,\" - P2 I2\"),\"\")","v":""},{"$f":"IF(CONCATENATE(C$15,K$3)=Matriz!$BE$81,CONCATENATE(Matriz!A81,\" - P2 I2\"),\"\")","v":""},{"$f":"IF(CONCATENATE(C$15,K$3)=Matriz!$BE$153,CONCATENATE(Matriz!A153,\" - P2 I2\"),\"\")","v":""},{"$f":"IF(CONCATENATE(C$15,K$3)=Matriz!$BE$225,CONCATENATE(Matriz!A225,\" - P2 I2\"),\"\")","v":""},{"$f":"IF(CONCATENATE(C$15,K$3)=Matriz!$BE$297,CONCATENATE(Matriz!A297,\" - P2 I2\"),\"\")","v":""},null,{"$f":"IF(CONCATENATE(C$15,Q$3)=Matriz!$BE$9,CONCATENATE(Matriz!A9,\" - P2 I3\"),\"\")","v":""},{"$f":"IF(CONCATENATE(C$15,Q$3)=Matriz!$BE$81,CONCATENATE(Matriz!A81,\" - P2 I3\"),\"\")","v":""},{"$f":"IF(CONCATENATE(C$15,Q$3)=Matriz!$BE$153,CONCATENATE(Matriz!A153,\" - P2 I3\"),\"\")","v":""},{"$f":"IF(CONCATENATE(C$15,Q$3)=Matriz!$BE$225,CONCATENATE(Matriz!A225,\" - P2 I3\"),\"\")","v":""},{"$f":"IF(CONCATENATE(C$15,Q$3)=Matriz!$BE$297,CONCATENATE(Matriz!A297,\" - P2 I3\"),\"\")","v":""},null,{"$f":"IF(CONCATENATE(C$15,W$3)=Matriz!$BE$9,CONCATENATE(Matriz!A9,\" - P2 I4\"),\"\")","v":""},{"$f":"IF(CONCATENATE(C$15,W$3)=Matriz!$BE$81,CONCATENATE(Matriz!A81,\" - P2 I4\"),\"\")","v":""},{"$f":"IF(CONCATENATE(C$15,W$3)=Matriz!$BE$153,CONCATENATE(Matriz!A153,\" - P2 I4\"),\"\")","v":""},{"$f":"IF(CONCATENATE(C$15,W$3)=Matriz!$BE$225,CONCATENATE(Matriz!A225,\" - P2 I4\"),\"\")","v":""},{"$f":"IF(CONCATENATE(C$15,W$3)=Matriz!$BE$297,CONCATENATE(Matriz!A297,\" - P2 I4\"),\"\")","v":""},null,{"$f":"IF(CONCATENATE(C$15,AC$3)=Matriz!$BE$9,CONCATENATE(Matriz!A9,\" - P2 I5\"),\"\")","v":""},{"$f":"IF(CONCATENATE(C$15,AC$3)=Matriz!$BE$81,CONCATENATE(Matriz!A81,\" - P2 I5\"),\"\")","v":""},{"$f":"IF(CONCATENATE(C$15,AC$3)=Matriz!$BE$153,CONCATENATE(Matriz!A153,\" - P2 I5\"),\"\")","v":""},{"$f":"IF(CONCATENATE(C$15,AC$3)=Matriz!$BE$225,CONCATENATE(Matriz!A225,\" - P2 I5\"),\"\")","v":""},{"$f":"IF(CONCATENATE(C$15,AC$3)=Matriz!$BE$297,CONCATENATE(Matriz!A297,\" - P2 I5\"),\"\")","v":""}]
[null,null,2,"IMPROBABLE",{"$f":"IF(CONCATENATE(C$15,E$3)=Matriz!$BE$18,CONCATENATE(Matriz!A18,\" - P2 I1\"),\"\")","v":""},{"$f":"IF(CONCATENATE(C$15,E$3)=Matriz!$BE$90,CONCATENATE(Matriz!A90,\" - P2 I1\"),\"\")","v":""},{"$f":"IF(CONCATENATE(C$15,E$3)=Matriz!$BE$162,CONCATENATE(Matriz!A162,\" - P2 I1\"),\"\")","v":""},{"$f":"IF(CONCATENATE(C$15,E$3)=Matriz!$BE$234,CONCATENATE(Matriz!A234,\" - P2 I1\"),\"\")","v":""},{"$f":"IF(CONCATENATE(C$15,E$3)=Matriz!$BE$306,CONCATENATE(Matriz!A306,\" - P2 I1\"),\"\")","v":""},null,{"$f":"IF(CONCATENATE(C$15,K$3)=Matriz!$BE$18,CONCATENATE(Matriz!A18,\" - P2 I2\"),\"\")","v":""},{"$f":"IF(CONCATENATE(C$15,K$3)=Matriz!$BE$90,CONCATENATE(Matriz!A90,\" - P2 I2\"),\"\")","v":""},{"$f":"IF(CONCATENATE(C$15,K$3)=Matriz!$BE$162,CONCATENATE(Matriz!A162,\" - P2 I2\"),\"\")","v":""},{"$f":"IF(CONCATENATE(C$15,K$3)=Matriz!$BE$234,CONCATENATE(Matriz!A234,\" - P2 I2\"),\"\")","v":""},{"$f":"IF(CONCATENATE(C$15,K$3)=Matriz!$BE$306,CONCATENATE(Matriz!A306,\" - P2 I2\"),\"\")","v":""},null,{"$f":"IF(CONCATENATE(C$15,Q$3)=Matriz!$BE$18,CONCATENATE(Matriz!A18,\" - P2 I3\"),\"\")","v":""},{"$f":"IF(CONCATENATE(C$15,Q$3)=Matriz!$BE$90,CONCATENATE(Matriz!A90,\" - P2 I3\"),\"\")","v":""},{"$f":"IF(CONCATENATE(C$15,Q$3)=Matriz!$BE$162,CONCATENATE(Matriz!A162,\" - P2 I3\"),\"\")","v":""},{"$f":"IF(CONCATENATE(C$15,Q$3)=Matriz!$BE$234,CONCATENATE(Matriz!A234,\" - P2 I3\"),\"\")","v":""},{"$f":"IF(CONCATENATE(C$15,Q$3)=Matriz!$BE$306,CONCATENATE(Matriz!A306,\" - P2 I3\"),\"\")","v":""},null,{"$f":"IF(CONCATENATE(C$15,W$3)=Matriz!$BE$18,CONCATENATE(Matriz!A18,\" - P2 I4\"),\"\")","v":""},{"$f":"IF(CONCATENATE(C$15,W$3)=Matriz!$BE$90,CONCATENATE(Matriz!A90,\" - P2 I4\"),\"\")","v":""},{"$f":"IF(CONCATENATE(C$15,W$3)=Matriz!$BE$162,CONCATENATE(Matriz!A162,\" - P2 I4\"),\"\")","v":""},{"$f":"IF(CONCATENATE(C$15,W$3)=Matriz!$BE$234,CONCATENATE(Matriz!A234,\" - P2 I4\"),\"\")","v":""},{"$f":"IF(CONCATENATE(C$15,W$3)=Matriz!$BE$306,CONCATENATE(Matriz!A306,\" - P2 I4\"),\"\")","v":""},null,{"$f":"IF(CONCATENATE(C$15,AC$3)=Matriz!$BE$18,CONCATENATE(Matriz!A18,\" - P2 I5\"),\"\")","v":""},{"$f":"IF(CONCATENATE(C$15,AC$3)=Matriz!$BE$90,CONCATENATE(Matriz!A90,\" - P2 I5\"),\"\")","v":""},{"$f":"IF(CONCATENATE(C$15,AC$3)=Matriz!$BE$162,CONCATENATE(Matriz!A162,\" - P2 I5\"),\"\")","v":""},{"$f":"IF(CONCATENATE(C$15,AC$3)=Matriz!$BE$234,CONCATENATE(Matriz!A234,\" - P2 I5\"),\"\")","v":""},{"$f":"IF(CONCATENATE(C$15,AC$3)=Matriz!$BE$306,CONCATENATE(Matriz!A306,\" - P2 I5\"),\"\")","v":""}]
[{"$nulls":4},{"$f":"IF(CONCATENATE(C$15,E$3)=Matriz!$BE$27,CONCATENATE(Matriz!A27,\" - P2 I1\"),\"\")","v":""},{"$f":"IF(CONCATENATE(C$15,E$3)=Matriz!$BE$99,CONCATENATE(Matriz!A99,\" - P2 I1\"),\"\")","v":""},{"$f":"IF(CONCATENATE(C$15,E$3)=Matriz!$BE$171,CONCATENATE(Matriz!A171,\" - P2 I1\"),\"\")","v":""},{"$f":"IF(CONCATENATE(C$15,E$3)=Matriz!$BE$243,CONCATENATE(Matriz!A243,\" - P2 I1\"),\"\")","v":""},{"$f":"IF(CONCATENATE(C$15,E$3)=Matriz!$BE$315,CONCATENATE(Matriz!A315,\" - P2 I1\"),\"\")","v":""},null,{"$f":"IF(CONCATENATE(C$15,K$3)=Matriz!$BE$27,CONCATENATE(Matriz!A27,\" - P2 I2\"),\"\")","v":""},{"$f":"IF(CONCATENATE(C$15,K$3)=Matriz!$BE$99,CONCATENATE(Matriz!A99,\" - P2 I2\"),\"\")","v":""},{"$f":"IF(CONCATENATE(C$15,K$3)=Matriz!$BE$171,CONCATENATE(Matriz!A171,\" - P2 I2\"),\"\")","v":""},{"$f":"IF(CONCATENATE(C$15,K$3)=Matriz!$BE$243,CONCATENATE(Matriz!A243,\" - P2 I2\"),\"\")","v":""},{"$f":"IF(CONCATENATE(C$15,K$3)=Matriz!$BE$315,CONCATENATE(Matriz!A315,\" - P2 I2\"),\"\")","v":""},null,{"$f":"IF(CONCATENATE(C$15,Q$3)=Matriz!$BE$27,CONCATENATE(Matriz!A27,\" - P2 I3\"),\"\")","v":""},{"$f":"IF(CONCATENATE(C$15,Q$3)=Matriz!$BE$99,CONCATENATE(Matriz!A99,\" - P2 I3\"),\"\")","v":""},{"$f":"IF(CONCATENATE(C$15,Q$3)=Matriz!$BE$171,CONCATENATE(Matriz!A171,\" - P2 I3\"),\"\")","v":""},{"$f":"IF(CONCATENATE(C$15,Q$3)=Matriz!$BE$243,CONCATENATE(Matriz!A243,\" - P2 I3\"),\"\")","v":""},{"$f":"IF(CONCATENATE(C$15,Q$3)=Matriz!$BE$315,CONCATENATE(Matriz!A315,\" - P2 I3\"),\"\")","v":""},null,{"$f":"IF(CONCATENATE(C$15,W$3)=Matriz!$BE$27,CONCATENATE(Matriz!A27,\" - P2 I4\"),\"\")","v":""},{"$f":"IF(CONCATENATE(C$15,W$3)=Matriz!$BE$99,CONCATENATE(Matriz!A99,\" - P2 I4\"),\"\")","v":"R11 - P2 I4"},{"$f":"IF(CONCATENATE(C$15,W$3)=Matriz!$BE$171,CONCATENATE(Matriz!A171,\" - P2 I4\"),\"\")","v":""},{"$f":"IF(CONCATENATE(C$15,W$3)=Matriz!$BE$243,CONCATENATE(Matriz!A243,\" - P2 I4\"),\"\")","v":""},{"$f":"IF(CONCATENATE(C$15,W$3)=Matriz!$BE$315,CONCATENATE(Matriz!A315,\" - P2 I4\"),\"\")","v":""},null,{"$f":"IF(CONCATENATE(C$15,AC$3)=Matriz!$BE$27,CONCATENATE(Matriz!A27,\" - P2 I5\"),\"\")","v":""},{"$f":"IF(CONCATENATE(C$15,AC$3)=Matriz!$BE$99,CONCATENATE(Matriz!A99,\" - P2 I5\"),\"\")","v":""},{"$f":"IF(CONCATENATE(C$15,AC$3)=Matriz!$BE$171,CONCATENATE(Matriz!A171,\" - P2 I5\"),\"\")","v":""},{"$f":"IF(CONCATENATE(C$15,AC$3)=Matriz!$BE$243,CONCATENATE(Matriz!A243,\" - P2 I5\"),\"\")","v":""},{"$f":"IF(CONCATENATE(C$15,AC$3)=Matriz!$BE$315,CONCATENATE(Matriz!A315,\" - P2 I5\"),\"\")","v":""}]
[{"$nulls":4},{"$f":"IF(CONCATENATE(C$15,E$3)=Matriz!$BE$36,CONCATENATE(Matriz!A36,\" - P2 I1\"),\"\")","v":""},{"$f":"IF(CONCATENATE(C$15,E$3)=Matriz!$BE$108,CONCATENATE(Matriz!A108,\" - P2 I1\"),\"\")","v":""},{"$f":"IF(CONCATENATE(C$15,E$3)=Matriz!$BE$180,CONCATENATE(Matriz!A180,\" - P2 I1\"),\"\")","v":""},{"$f":"IF(CONCATENATE(C$15,E$3)=Matriz!$BE$252,CONCATENATE(Matriz!A252,\" - P2 I1\"),\"\")","v":""},{"$f":"IF(CONCATENATE(C$15,E$3)=Matriz!$BE$324,CONCATENATE(Matriz!A324,\" - P2 I1\"),\"\")","v":""},null,{"$f":"IF(CONCATENATE(C$15,K$3)=Matriz!$BE$36,CONCATENATE(Matriz!A36,\" - P2 I2\"),\"\")","v":""},{"$f":"IF(CONCATENATE(C$15,K$3)=Matriz!$BE$108,CONCATENATE(Matriz!A108,\" - P2 I2\"),\"\")","v":""},{"$f":"IF(CONCATENATE(C$15,K$3)=Matriz!$BE$180,CONCATENATE(Matriz!A180,\" - P2 I2\"),\"\")","v":""},{"$f":"IF(CONCATENATE(C$15,K$3)=Matriz!$BE$252,CONCATENATE(Matriz!A252,\" - P2 I2\"),\"\")","v":""},{"$f":"IF(CONCATENATE(C$15,K$3)=Matriz!$BE$324,CONCATENATE(Matriz!A324,\" - P2 I2\"),\"\")","v":""},null,{"$f":"IF(CONCATENATE(C$15,Q$3)=Matriz!$BE$36,CONCATENATE(Matriz!A36,\" - P2 I3\"),\"\")","v":""},{"$f":"IF(CONCATENATE(C$15,Q$3)=Matriz!$BE$108,CONCATENATE(Matriz!A108,\" - P2 I3\"),\"\")","v":""},{"$f":"IF(CONCATENATE(C$15,Q$3)=Matriz!$BE$180,CONCATENATE(Matriz!A180,\" - P2 I3\"),\"\")","v":""},{"$f":"IF(CONCATENATE(C$15,Q$3)=Matriz!$BE$252,CONCATENATE(Matriz!A252,\" - P2 I3\"),\"\")","v":""},{"$f":"IF(CONCATENATE(C$15,Q$3)=Matriz!$BE$324,CONCATENATE(Matriz!A324,\" - P2 I3\"),\"\")","v":""},null,{"$f":"IF(CONCATENATE(C$15,W$3)=Matriz!$BE$36,CONCATENATE(Matriz!A36,\" - P2 I4\"),\"\")","v":""},{"$f":"IF(CONCATENATE(C$15,W$3)=Matriz!$BE$108,CONCATENATE(Matriz!A108,\" - P2 I4\"),\"\")","v":""},{"$f":"IF(CONCATENATE(C$15,W$3)=Matriz!$BE$180,CONCATENATE(Matriz!A180,\" - P2 I4\"),\"\")","v":""},{"$f":"IF(CONCATENATE(C$15,W$3)=Matriz!$BE$252,CONCATENATE(Matriz!A252,\" - P2 I4\"),\"\")","v":""},{"$f":"IF(CONCATENATE(C$15,W$3)=Matriz!$BE$324,CONCATENATE(Matriz!A324,\" - P2 I4\"),\"\")","v":""},null,{"$f":"IF(CONCATENATE(C$15,AC$3)=Matriz!$BE$36,CONCATENATE(Matriz!A36,\" - P2 I5\"),\"\")","v":""},{"$f":"IF(CONCATENATE(C$15,AC$3)=Matriz!$BE$108,CONCATENATE(Matriz!A108,\" - P2 I5\"),\"\")","v":""},{"$f":"IF(CONCATENATE(C$15,AC$3)=Matriz!$BE$180,CONCATENATE(Matriz!A180,\" - P2 I5\"),\"\")","v":""},{"$f":"IF(CONCATENATE(C$15,AC$3)=Matriz!$BE$252,CONCATENATE(Matriz!A252,\" - P2 I5\"),\"\")","v":""},{"$f":"IF(CONCATENATE(C$15,AC$3)=Matriz!$BE$324,CONCATENATE(Matriz!A324,\" - P2 I5\"),\"\")","v":""}]
[{"$nulls":4},{"$f":"IF(CONCATENATE(C$15,E$3)=Matriz!$BE$45,CONCATENATE(Matriz!A45,\" - P2 I1\"),\"\")","v":""},{"$f":"IF(CONCATENATE(C$15,E$3)=Matriz!$BE$117,CONCATENATE(Matriz!A117,\" - P2 I1\"),\"\")","v":""},{"$f":"IF(CONCATENATE(C$15,E$3)=Matriz!$BE$189,CONCATENATE(Matriz!A189,\" - P2 I1\"),\"\")","v":""},{"$f":"IF(CONCATENATE(C$15,E$3)=Matriz!$BE$261,CONCATENATE(Matriz!A261,\" - P2 I1\"),\"\")","v":""},{"$f":"IF(CONCATENATE(C$15,E$3)=Matriz!$BE$333,CONCATENATE(Matriz!A333,\" - P2 I1\"),\"\")","v":""},null,{"$f":"IF(CONCATENATE(C$15,K$3)=Matriz!$BE$45,CONCATENATE(Matriz!A45,\" - P2 I2\"),\"\")","v":""},{"$f":"IF(CONCATENATE(C$15,K$3)=Matriz!$BE$117,CONCATENATE(Matriz!A117,\" - P2 I2\"),\"\")","v":""},{"$f":"IF(CONCATENATE(C$15,K$3)=Matriz!$BE$189,CONCATENATE(Matriz!A189,\" - P2 I2\"),\"\")","v":""},{"$f":"IF(CONCATENATE(C$15,K$3)=Matriz!$BE$261,CONCATENATE(Matriz!A261,\" - P2 I2\"),\"\")","v":""},{"$f":"IF(CONCATENATE(C$15,K$3)=Matriz!$BE$333,CONCATENATE(Matriz!A333,\" - P2 I2\"),\"\")","v":""},null,{"$f":"IF(CONCATENATE(C$15,Q$3)=Matriz!$BE$45,CONCATENATE(Matriz!A45,\" - P2 I3\"),\"\")","v":""},{"$f":"IF(CONCATENATE(C$15,Q$3)=Matriz!$BE$117,CONCATENATE(Matriz!A117,\" - P2 I3\"),\"\")","v":""},{"$f":"IF(CONCATENATE(C$15,Q$3)=Matriz!$BE$189,CONCATENATE(Matriz!A189,\" - P2 I3\"),\"\")","v":""},{"$f":"IF(CONCATENATE(C$15,Q$3)=Matriz!$BE$261,CONCATENATE(Matriz!A261,\" - P2 I3\"),\"\")","v":""},{"$f":"IF(CONCATENATE(C$15,Q$3)=Matriz!$BE$333,CONCATENATE(Matriz!A333,\" - P2 I3\"),\"\")","v":""},null,{"$f":"IF(CONCATENATE(C$15,W$3)=Matriz!$BE$45,CONCATENATE(Matriz!A45,\" - P2 I4\"),\"\")","v":""},{"$f":"IF(CONCATENATE(C$15,W$3)=Matriz!$BE$117,CONCATENATE(Matriz!A117,\" - P2 I4\"),\"\")","v":""},{"$f":"IF(CONCATENATE(C$15,W$3)=Matriz!$BE$189,CONCATENATE(Matriz!A189,\" - P2 I4\"),\"\")","v":""},{"$f":"IF(CONCATENATE(C$15,W$3)=Matriz!$BE$261,CONCATENATE(Matriz!A261,\" - P2 I4\"),\"\")","v":""},{"$f":"IF(CONCATENATE(C$15,W$3)=Matriz!$BE$333,CONCATENATE(Matriz!A333,\" - P2 I4\"),\"\")","v":""},null,{"$f":"IF(CONCATENATE(C$15,AC$3)=Matriz!$BE$45,CONCATENATE(Matriz!A45,\" - P2 I5\"),\"\")","v":""},{"$f":"IF(CONCATENATE(C$15,AC$3)=Matriz!$BE$117,CONCATENATE(Matriz!A117,\" - P2 I5\"),\"\")","v":""},{"$f":"IF(CONCATENATE(C$15,AC$3)=Matriz!$BE$189,CONCATENATE(Matriz!A189,\" - P2 I5\"),\"\")","v":""},{"$f":"IF(CONCATENATE(C$15,AC$3)=Matriz!$BE$261,CONCATENATE(Matriz!A261,\" - P2 I5\"),\"\")","v":""},{"$f":"IF(CONCATENATE(C$15,AC$3)=Matriz!$BE$333,CONCATENATE(Matriz!A333,\" - P2 I5\"),\"\")","v":""}]
[{"$nulls":4},{"$f":"IF(CONCATENATE(C$15,E$3)=Matriz!$BE$54,CONCATENATE(Matriz!A54,\" - P2 I1\"),\"\")","v":""},{"$f":"IF(CONCATENATE(C$15,E$3)=Matriz!$BE$126,CONCATENATE(Matriz!A126,\" - P2 I1\"),\"\")","v":""},{"$f":"IF(CONCATENATE(C$15,E$3)=Matriz!$BE$198,CONCATENATE(Matriz!A198,\" - P2 I1\"),\"\")","v":""},{"$f":"IF(CONCATENATE(C$15,E$3)=Matriz!$BE$270,CONCATENATE(Matriz!A270,\" - P2 I1\"),\"\")","v":""},{"$f":"IF(CONCATENATE(C$15,E$3)=Matriz!$BE$342,CONCATENATE(Matriz!A342,\" - P2 I1\"),\"\")","v":""},null,{"$f":"IF(CONCATENATE(C$15,K$3)=Matriz!$BE$54,CONCATENATE(Matriz!A54,\" - P2 I2\"),\"\")","v":""},{"$f":"IF(CONCATENATE(C$15,K$3)=Matriz!$BE$126,CONCATENATE(Matriz!A126,\" - P2 I2\"),\"\")","v":""},{"$f":"IF(CONCATENATE(C$15,K$3)=Matriz!$BE$198,CONCATENATE(Matriz!A198,\" - P2 I2\"),\"\")","v":""},{"$f":"IF(CONCATENATE(C$15,K$3)=Matriz!$BE$270,CONCATENATE(Matriz!A270,\" - P2 I2\"),\"\")","v":""},{"$f":"IF(CONCATENATE(C$15,K$3)=Matriz!$BE$342,CONCATENATE(Matriz!A342,\" - P2 I2\"),\"\")","v":""},null,{"$f":"IF(CONCATENATE(C$15,Q$3)=Matriz!$BE$54,CONCATENATE(Matriz!A54,\" - P2 I3\"),\"\")","v":""},{"$f":"IF(CONCATENATE(C$15,Q$3)=Matriz!$BE$126,CONCATENATE(Matriz!A126,\" - P2 I3\"),\"\")","v":""},{"$f":"IF(CONCATENATE(C$15,Q$3)=Matriz!$BE$198,CONCATENATE(Matriz!A198,\" - P2 I3\"),\"\")","v":""},{"$f":"IF(CONCATENATE(C$15,Q$3)=Matriz!$BE$270,CONCATENATE(Matriz!A270,\" - P2 I3\"),\"\")","v":""},{"$f":"IF(CONCATENATE(C$15,Q$3)=Matriz!$BE$342,CONCATENATE(Matriz!A342,\" - P2 I3\"),\"\")","v":""},null,{"$f":"IF(CONCATENATE(C$15,W$3)=Matriz!$BE$54,CONCATENATE(Matriz!A54,\" - P2 I4\"),\"\")","v":""},{"$f":"IF(CONCATENATE(C$15,W$3)=Matriz!$BE$126,CONCATENATE(Matriz!A126,\" - P2 I4\"),\"\")","v":""},{"$f":"IF(CONCATENATE(C$15,W$3)=Matriz!$BE$198,CONCATENATE(Matriz!A198,\" - P2 I4\"),\"\")","v":""},{"$f":"IF(CONCATENATE(C$15,W$3)=Matriz!$BE$270,CONCATENATE(Matriz!A270,\" - P2 I4\"),\"\")","v":""},{"$f":"IF(CONCATENATE(C$15,W$3)=Matriz!$BE$342,CONCATENATE(Matriz!A342,\" - P2 I4\"),\"\")","v":""},null,{"$f":"IF(CONCATENATE(C$15,AC$3)=Matriz!$BE$54,CONCATENATE(Matriz!A54,\" - P2 I5\"),\"\")","v":""},{"$f":"IF(CONCATENATE(C$15,AC$3)=Matriz!$BE$126,CONCATENATE(Matriz!A126,\" - P2 I5\"),\"\")","v":""},{"$f":"IF(CONCATENATE(C$15,AC$3)=Matriz!$BE$198,CONCATENATE(Matriz!A198,\" - P2 I5\"),\"\")","v":""},{"$f":"IF(CONCATENATE(C$15,AC$3)=Matriz!$BE$270,CONCATENATE(Matriz!A270,\" - P2 I5\"),\"\")","v":""},{"$f":"IF(CONCATENATE(C$15,AC$3)=Matriz!$BE$342,CONCATENATE(Matriz!A342,\" - P2 I5\"),\"\")","v":""}]
[{"$nulls":4},{"$f":"IF(CONCATENATE(C$15,E$3)=Matriz!$BE$63,CONCATENATE(Matriz!A63,\" - P2 I1\"),\"\")","v":""},{"$f":"IF(CONCATENATE(C$15,E$3)=Matriz!$BE$135,CONCATENATE(Matriz!A135,\" - P2 I1\"),\"\")","v":""},{"$f":"IF(CONCATENATE(C$15,E$3)=Matriz!$BE$207,CONCATENATE(Matriz!A207,\" - P2 I1\"),\"\")","v":""},{"$f":"IF(CONCATENATE(C$15,E$3)=Matriz!$BE$279,CONCATENATE(Matriz!A279,\" - P2 I1\"),\"\")","v":""},{"$f":"IF(CONCATENATE(C$15,E$3)=Matriz!$BE$351,CONCATENATE(Matriz!A351,\" - P2 I1\"),\"\")","v":""},null,{"$f":"IF(CONCATENATE(C$15,K$3)=Matriz!$BE$63,CONCATENATE(Matriz!A63,\" - P2 I2\"),\"\")","v":""},{"$f":"IF(CONCATENATE(C$15,K$3)=Matriz!$BE$135,CONCATENATE(Matriz!A135,\" - P2 I2\"),\"\")","v":""},{"$f":"IF(CONCATENATE(C$15,K$3)=Matriz!$BE$207,CONCATENATE(Matriz!A207,\" - P2 I2\"),\"\")","v":""},{"$f":"IF(CONCATENATE(C$15,K$3)=Matriz!$BE$279,CONCATENATE(Matriz!A279,\" - P2 I2\"),\"\")","v":""},{"$f":"IF(CONCATENATE(C$15,K$3)=Matriz!$BE$351,CONCATENATE(Matriz!A351,\" - P2 I2\"),\"\")","v":""},null,{"$f":"IF(CONCATENATE(C$15,Q$3)=Matriz!$BE$63,CONCATENATE(Matriz!A63,\" - P2 I3\"),\"\")","v":""},{"$f":"IF(CONCATENATE(C$15,Q$3)=Matriz!$BE$135,CONCATENATE(Matriz!A135,\" - P2 I3\"),\"\")","v":""},{"$f":"IF(CONCATENATE(C$15,Q$3)=Matriz!$BE$207,CONCATENATE(Matriz!A207,\" - P2 I3\"),\"\")","v":""},{"$f":"IF(CONCATENATE(C$15,Q$3)=Matriz!$BE$279,CONCATENATE(Matriz!A279,\" - P2 I3\"),\"\")","v":""},{"$f":"IF(CONCATENATE(C$15,Q$3)=Matriz!$BE$351,CONCATENATE(Matriz!A351,\" - P2 I3\"),\"\")","v":""},null,{"$f":"IF(CONCATENATE(C$15,W$3)=Matriz!$BE$63,CONCATENATE(Matriz!A63,\" - P2 I4\"),\"\")","v":""},{"$f":"IF(CONCATENATE(C$15,W$3)=Matriz!$BE$135,CONCATENATE(Matriz!A135,\" - P2 I4\"),\"\")","v":""},{"$f":"IF(CONCATENATE(C$15,W$3)=Matriz!$BE$207,CONCATENATE(Matriz!A207,\" - P2 I4\"),\"\")","v":""},{"$f":"IF(CONCATENATE(C$15,W$3)=Matriz!$BE$279,CONCATENATE(Matriz!A279,\" - P2 I4\"),\"\")","v":""},{"$f":"IF(CONCATENATE(C$15,W$3)=Matriz!$BE$351,CONCATENATE(Matriz!A351,\" - P2 I4\"),\"\")","v":""},null,{"$f":"IF(CONCATENATE(C$15,AC$3)=Matriz!$BE$63,CONCATENATE(Matriz!A63,\" - P2 I5\"),\"\")","v":""},{"$f":"IF(CONCATENATE(C$15,AC$3)=Matriz!$BE$135,CONCATENATE(Matriz!A135,\" - P2 I5\"),\"\")","v":""},{"$f":"IF(CONCATENATE(C$15,AC$3)=Matriz!$BE$207,CONCATENATE(Matriz!A207,\" - P2 I5\"),\"\")","v":""},{"$f":"IF(CONCATENATE(C$15,AC$3)=Matriz!$BE$279,CONCATENATE(Matriz!A279,\" - P2 I5\"),\"\")","v":""},{"$f":"IF(CONCATENATE(C$15,AC$3)=Matriz!$BE$351,CONCATENATE(Matriz!A351,\" - P2 I5\"),\"\")","v":""}]
[{"$nulls":4},{"$f":"IF(CONCATENATE(C$15,E$3)=Matriz!$BE$72,CONCATENATE(Matriz!A72,\" - P2 I1\"),\"\")","v":""},{"$f":"IF(CONCATENATE(C$15,E$3)=Matriz!$BE$144,CONCATENATE(Matriz!A144,\" - P2 I1\"),\"\")","v":""},{"$f":"IF(CONCATENATE(C$15,E$3)=Matriz!$BE$216,CONCATENATE(Matriz!A216,\" - P2 I1\"),\"\")","v":""},{"$f":"IF(CONCATENATE(C$15,E$3)=Matriz!$BE$288,CONCATENATE(Matriz!A288,\" - P2 I1\"),\"\")","v":""},{"$f":"IF(CONCATENATE(C$15,E$3)=Matriz!$BE$360,CONCATENATE(Matriz!A360,\" - P2 I1\"),\"\")","v":""},null,{"$f":"IF(CONCATENATE(C$15,K$3)=Matriz!$BE$72,CONCATENATE(Matriz!A72,\" - P2 I2\"),\"\")","v":""},{"$f":"IF(CONCATENATE(C$15,K$3)=Matriz!$BE$144,CONCATENATE(Matriz!A144,\" - P2 I2\"),\"\")","v":""},{"$f":"IF(CONCATENATE(C$15,K$3)=Matriz!$BE$216,CONCATENATE(Matriz!A216,\" - P2 I2\"),\"\")","v":""},{"$f":"IF(CONCATENATE(C$15,K$3)=Matriz!$BE$288,CONCATENATE(Matriz!A288,\" - P2 I2\"),\"\")","v":""},{"$f":"IF(CONCATENATE(C$15,K$3)=Matriz!$BE$360,CONCATENATE(Matriz!A360,\" - P2 I2\"),\"\")","v":""},null,{"$f":"IF(CONCATENATE(C$15,Q$3)=Matriz!$BE$72,CONCATENATE(Matriz!A72,\" - P2 I3\"),\"\")","v":""},{"$f":"IF(CONCATENATE(C$15,Q$3)=Matriz!$BE$144,CONCATENATE(Matriz!A144,\" - P2 I3\"),\"\")","v":""},{"$f":"IF(CONCATENATE(C$15,Q$3)=Matriz!$BE$216,CONCATENATE(Matriz!A216,\" - P2 I3\"),\"\")","v":""},{"$f":"IF(CONCATENATE(C$15,Q$3)=Matriz!$BE$288,CONCATENATE(Matriz!A288,\" - P2 I3\"),\"\")","v":""},{"$f":"IF(CONCATENATE(C$15,Q$3)=Matriz!$BE$360,CONCATENATE(Matriz!A360,\" - P2 I3\"),\"\")","v":""},null,{"$f":"IF(CONCATENATE(C$15,W$3)=Matriz!$BE$72,CONCATENATE(Matriz!A72,\" - P2 I4\"),\"\")","v":""},{"$f":"IF(CONCATENATE(C$15,W$3)=Matriz!$BE$144,CONCATENATE(Matriz!A144,\" - P2 I4\"),\"\")","v":""},{"$f":"IF(CONCATENATE(C$15,W$3)=Matriz!$BE$216,CONCATENATE(Matriz!A216,\" - P2 I4\"),\"\")","v":""},{"$f":"IF(CONCATENATE(C$15,W$3)=Matriz!$BE$288,CONCATENATE(Matriz!A288,\" - P2 I4\"),\"\")","v":""},{"$f":"IF(CONCATENATE(C$15,W$3)=Matriz!$BE$360,CONCATENATE(Matriz!A360,\" - P2 I4\"),\"\")","v":""},null,{"$f":"IF(CONCATENATE(C$15,AC$3)=Matriz!$BE$72,CONCATENATE(Matriz!A72,\" - P2 I5\"),\"\")","v":""},{"$f":"IF(CONCATENATE(C$15,AC$3)=Matriz!$BE$144,CONCATENATE(Matriz!A144,\" - P2 I5\"),\"\")","v":""},{"$f":"IF(CONCATENATE(C$15,AC$3)=Matriz!$BE$216,CONCATENATE(Matriz!A216,\" - P2 I5\"),\"\")","v":""},{"$f":"IF(CONCATENATE(C$15,AC$3)=Matriz!$BE$288,CONCATENATE(Matriz!A288,\" - P2 I5\"),\"\")","v":""},{"$f":"IF(CONCATENATE(C$15,AC$3)=Matriz!$BE$360,CONCATENATE(Matriz!A360,\" - P2 I5\"),\"\")","v":""}]
[{"$nulls":4},{"$f":"IF(CONCATENATE(C$23,E$3)=Matriz!$BE$9,CONCATENATE(Matriz!A9,\" - P3 I1\"),\"\")","v":""},{"$f":"IF(CONCATENATE(C$23,E$3)=Matriz!$BE$81,CONCATENATE(Matriz!A81,\" - P3 I1\"),\"\")","v":""},{"$f":"IF(CONCATENATE(C$23,E$3)=Matriz!$BE$153,CONCATENATE(Matriz!A153,\" - P3 I1\"),\"\")","v":""},{"$f":"IF(CONCATENATE(C$23,E$3)=Matriz!$BE$225,CONCATENATE(Matriz!A225,\" - P3 I1\"),\"\")","v":""},{"$f":"IF(CONCATENATE(C$23,E$3)=Matriz!$BE$297,CONCATENATE(Matriz!A297,\" - P3 I1\"),\"\")","v":""},null,{"$f":"IF(CONCATENATE(C$23,K$3)=Matriz!$BE$9,CONCATENATE(Matriz!A9,\" - P3 I2\"),\"\")","v":""},{"$f":"IF(CONCATENATE(C$23,K$3)=Matriz!$BE$81,CONCATENATE(Matriz!A81,\" - P3 I2\"),\"\")","v":""},{"$f":"IF(CONCATENATE(C$23,K$3)=Matriz!$BE$153,CONCATENATE(Matriz!A153,\" - P3 I2\"),\"\")","v":""},{"$f":"IF(CONCATENATE(C$23,K$3)=Matriz!$BE$225,CONCATENATE(Matriz!A225,\" - P3 I2\"),\"\")","v":""},{"$f":"IF(CONCATENATE(C$23,K$3)=Matriz!$BE$297,CONCATENATE(Matriz!A297,\" - P3 I2\"),\"\")","v":""},null,{"$f":"IF(CONCATENATE(C$23,Q$3)=Matriz!$BE$9,CONCATENATE(Matriz!A9,\" - P3 I3\"),\"\")","v":"R1 - P3 I3"},{"$f":"IF(CONCATENATE(C$23,Q$3)=Matriz!$BE$81,CONCATENATE(Matriz!A81,\" - P3 I3\"),\"\")","v":"R9 - P3 I3"},{"$f":"IF(CONCATENATE(C$23,Q$3)=Matriz!$BE$153,CONCATENATE(Matriz!A153,\" - P3 I3\"),\"\")","v":""},{"$f":"IF(CONCATENATE(C$23,Q$3)=Matriz!$BE$225,CONCATENATE(Matriz!A225,\" - P3 I3\"),\"\")","v":""},{"$f":"IF(CONCATENATE(C$23,Q$3)=Matriz!$BE$297,CONCATENATE(Matriz!A297,\" - P3 I3\"),\"\")","v":""},null,{"$f":"IF(CONCATENATE(C$23,W$3)=Matriz!$BE$9,CONCATENATE(Matriz!A9,\" - P3 I4\"),\"\")","v":""},{"$f":"IF(CONCATENATE(C$23,W$3)=Matriz!$BE$81,CONCATENATE(Matriz!A81,\" - P3 I4\"),\"\")","v":""},{"$f":"IF(CONCATENATE(C$23,W$3)=Matriz!$BE$153,CONCATENATE(Matriz!A153,\" - P3 I4\"),\"\")","v":""},{"$f":"IF(CONCATENATE(C$23,W$3)=Matriz!$BE$225,CONCATENATE(Matriz!A225,\" - P3 I4\"),\"\")","v":""},{"$f":"IF(CONCATENATE(C$23,W$3)=Matriz!$BE$297,CONCATENATE(Matriz!A297,\" - P3 I4\"),\"\")","v":""},null,{"$f":"IF(CONCATENATE(C$23,AC$3)=Matriz!$BE$9,CONCATENATE(Matriz!A9,\" - P3 I5\"),\"\")","v":""},{"$f":"IF(CONCATENATE(C$23,AC$3)=Matriz!$BE$81,CONCATENATE(Matriz!A81,\" - P3 I5\"),\"\")","v":""},{"$f":"IF(CONCATENATE(C$23,AC$3)=Matriz!$BE$153,CONCATENATE(Matriz!A153,\" - P3 I5\"),\"\")","v":""},{"$f":"IF(CONCATENATE(C$23,AC$3)=Matriz!$BE$225,CONCATENATE(Matriz!A225,\" - P3 I5\"),\"\")","v":""},{"$f":"IF(CONCATENATE(C$23,AC$3)=Matriz!$BE$297,CONCATENATE(Matriz!A297,\" - P3 I5\"),\"\")","v":""}]
[null,null,3,"MODERADO",{"$f":"IF(CONCATENATE(C$23,E$3)=Matriz!$BE$18,CONCATENATE(Matriz!A18,\" - P3 I1\"),\"\")","v":""},{"$f":"IF(CONCATENATE(C$23,E$3)=Matriz!$BE$90,CONCATENATE(Matriz!A90,\" - P3 I1\"),\"\")","v":""},{"$f":"IF(CONCATENATE(C$23,E$3)=Matriz!$BE$162,CONCATENATE(Matriz!A162,\" - P3 I1\"),\"\")","v":""},{"$f":"IF(CONCATENATE(C$23,E$3)=Matriz!$BE$234,CONCATENATE(Matriz!A234,\" - P3 I1\"),\"\")","v":""},{"$f":"IF(CONCATENATE(C$23,E$3)=Matriz!$BE$306,CONCATENATE(Matriz!A306,\" - P3 I1\"),\"\")","v":""},null,{"$f":"IF(CONCATENATE(C$23,K$3)=Matriz!$BE$18,CONCATENATE(Matriz!A18,\" - P3 I2\"),\"\")","v":""},{"$f":"IF(CONCATENATE(C$23,K$3)=Matriz!$BE$90,CONCATENATE(Matriz!A90,\" - P3 I2\"),\"\")","v":""},{"$f":"IF(CONCATENATE(C$23,K$3)=Matriz!$BE$162,CONCATENATE(Matriz!A162,\" - P3 I2\"),\"\")","v":""},{"$f":"IF(CONCATENATE(C$23,K$3)=Matriz!$BE$234,CONCATENATE(Matriz!A234,\" - P3 I2\"),\"\")","v":""},{"$f":"IF(CONCATENATE(C$23,K$3)=Matriz!$BE$306,CONCATENATE(Matriz!A306,\" - P3 I2\"),\"\")","v":""},null,{"$f":"IF(CONCATENATE(C$23,Q$3)=Matriz!$BE$18,CONCATENATE(Matriz!A18,\" - P3 I3\"),\"\")","v":""},{"$f":"IF(CONCATENATE(C$23,Q$3)=Matriz!$BE$90,CONCATENATE(Matriz!A90,\" - P3 I3\"),\"\")","v":""},{"$f":"IF(CONCATENATE(C$23,Q$3)=Matriz!$BE$162,CONCATENATE(Matriz!A162,\" - P3 I3\"),\"\")","v":""},{"$f":"IF(CONCATENATE(C$23,Q$3)=Matriz!$BE$234,CONCATENATE(Matriz!A234,\" - P3 I3\"),\"\")","v":""},{"$f":"IF(CONCATENATE(C$23,Q$3)=Matriz!$BE$306,CONCATENATE(Matriz!A306,\" - P3 I3\"),\"\")","v":""},null,{"$f":"IF(CONCATENATE(C$23,W$3)=Matriz!$BE$18,CONCATENATE(Matriz!A18,\" - P3 I4\"),\"\")","v":"R2 - P3 I4"},{"$f":"IF(CONCATENATE(C$23,W$3)=Matriz!$BE$90,CONCATENATE(Matriz!A90,\" - P3 I4\"),\"\")","v":""},{"$f":"IF(CONCATENATE(C$23,W$3)=Matriz!$BE$162,CONCATENATE(Matriz!A162,\" - P3 I4\"),\"\")","v":""},{"$f":"IF(CONCATENATE(C$23,W$3)=Matriz!$BE$234,CONCATENATE(Matriz!A234,\" - P3 I4\"),\"\")","v":""},{"$f":"IF(CONCATENATE(C$23,W$3)=Matriz!$BE$306,CONCATENATE(Matriz!A306,\" - P3 I4\"),\"\")","v":""},null,{"$f":"IF(CONCATENATE(C$23,AC$3)=Matriz!$BE$18,CONCATENATE(Matriz!A18,\" - P3 I5\"),\"\")","v":""},{"$f":"IF(CONCATENATE(C$23,AC$3)=Matriz!$BE$90,CONCATENATE(Matriz!A90,\" - P3 I5\"),\"\")","v":""},{"$f":"IF(CONCATENATE(C$23,AC$3)=Matriz!$BE$162,CONCATENATE(Matriz!A162,\" - P3 I5\"),\"\")","v":""},{"$f":"IF(CONCATENATE(C$23,AC$3)=Matriz!$BE$234,CONCATENATE(Matriz!A234,\" - P3 I5\"),\"\")","v":""},{"$f":"IF(CONCATENATE(C$23,AC$3)=Matriz!$BE$306,CONCATENATE(Matriz!A306,\" - P3 I5\"),\"\")","v":""}]
[{"$nulls":4},{"$f":"IF(CONCATENATE(C$23,E$3)=Matriz!$BE$27,CONCATENATE(Matriz!A27,\" - P3 I1\"),\"\")","v":""},{"$f":"IF(CONCATENATE(C$23,E$3)=Matriz!$BE$99,CONCATENATE(Matriz!A99,\" - P3 I1\"),\"\")","v":""},{"$f":"IF(CONCATENATE(C$23,E$3)=Matriz!$BE$171,CONCATENATE(Matriz!A171,\" - P3 I1\"),\"\")","v":""},{"$f":"IF(CONCATENATE(C$23,E$3)=Matriz!$BE$243,CONCATENATE(Matriz!A243,\" - P3 I1\"),\"\")","v":""},{"$f":"IF(CONCATENATE(C$23,E$3)=Matriz!$BE$315,CONCATENATE(Matriz!A315,\" - P3 I1\"),\"\")","v":""},null,{"$f":"IF(CONCATENATE(C$23,K$3)=Matriz!$BE$27,CONCATENATE(Matriz!A27,\" - P3 I2\"),\"\")","v":""},{"$f":"IF(CONCATENATE(C$23,K$3)=Matriz!$BE$99,CONCATENATE(Matriz!A99,\" - P3 I2\"),\"\")","v":""},{"$f":"IF(CONCATENATE(C$23,K$3)=Matriz!$BE$171,CONCATENATE(Matriz!A171,\" - P3 I2\"),\"\")","v":""},{"$f":"IF(CONCATENATE(C$23,K$3)=Matriz!$BE$243,CONCATENATE(Matriz!A243,\" - P3 I2\"),\"\")","v":""},{"$f":"IF(CONCATENATE(C$23,K$3)=Matriz!$BE$315,CONCATENATE(Matriz!A315,\" - P3 I2\"),\"\")","v":""},null,{"$f":"IF(CONCATENATE(C$23,Q$3)=Matriz!$BE$27,CONCATENATE(Matriz!A27,\" - P3 I3\"),\"\")","v":""},{"$f":"IF(CONCATENATE(C$23,Q$3)=Matriz!$BE$99,CONCATENATE(Matriz!A99,\" - P3 I3\"),\"\")","v":""},{"$f":"IF(CONCATENATE(C$23,Q$3)=Matriz!$BE$171,CONCATENATE(Matriz!A171,\" - P3 I3\"),\"\")","v":""},{"$f":"IF(CONCATENATE(C$23,Q$3)=Matriz!$BE$243,CONCATENATE(Matriz!A243,\" - P3 I3\"),\"\")","v":""},{"$f":"IF(CONCATENATE(C$23,Q$3)=Matriz!$BE$315,CONCATENATE(Matriz!A315,\" - P3 I3\"),\"\")","v":""},null,{"$f":"IF(CONCATENATE(C$23,W$3)=Matriz!$BE$27,CONCATENATE(Matriz!A27,\" - P3 I4\"),\"\")","v":""},{"$f":"IF(CONCATENATE(C$23,W$3)=Matriz!$BE$99,CONCATENATE(Matriz!A99,\" - P3 I4\"),\"\")","v":""},{"$f":"IF(CONCATENATE(C$23,W$3)=Matriz!$BE$171,CONCATENATE(Matriz!A171,\" - P3 I4\"),\"\")","v":"R19 - P3 I4"},{"$f":"IF(CONCATENATE(C$23,W$3)=Matriz!$BE$243,CONCATENATE(Matriz!A243,\" - P3 I4\"),\"\")","v":""},{"$f":"IF(CONCATENATE(C$23,W$3)=Matriz!$BE$315,CONCATENATE(Matriz!A315,\" - P3 I4\"),\"\")","v":""},null,{"$f":"IF(CONCATENATE(C$23,AC$3)=Matriz!$BE$27,CONCATENATE(Matriz!A27,\" - P3 I5\"),\"\")","v":""},{"$f":"IF(CONCATENATE(C$23,AC$3)=Matriz!$BE$99,CONCATENATE(Matriz!A99,\" - P3 I5\"),\"\")","v":""},{"$f":"IF(CONCATENATE(C$23,AC$3)=Matriz!$BE$171,CONCATENATE(Matriz!A171,\" - P3 I5\"),\"\")","v":""},{"$f":"IF(CONCATENATE(C$23,AC$3)=Matriz!$BE$243,CONCATENATE(Matriz!A243,\" - P3 I5\"),\"\")","v":""},{"$f":"IF(CONCATENATE(C$23,AC$3)=Matriz!$BE$315,CONCATENATE(Matriz!A315,\" - P3 I5\"),\"\")","v":""}]
[{"$nulls":4},{"$f":"IF(CONCATENATE(C$23,E$3)=Matriz!$BE$36,CONCATENATE(Matriz!A36,\" - P3 I1\"),\"\")","v":""},{"$f":"IF(CONCATENATE(C$23,E$3)=Matriz!$BE$108,CONCATENATE(Matriz!A108,\" - P3 I1\"),\"\")","v":""},{"$f":"IF(CONCATENATE(C$23,E$3)=Matriz!$BE$180,CONCATENATE(Matriz!A180,\" - P3 I1\"),\"\")","v":""},{"$f":"IF(CONCATENATE(C$23,E$3)=Matriz!$BE$252,CONCATENATE(Matriz!A252,\" - P3 I1\"),\"\")","v":""},{"$f":"IF(CONCATENATE(C$23,E$3)=Matriz!$BE$324,CONCATENATE(Matriz!A324,\" - P3 I1\"),\"\")","v":""},null,{"$f":"IF(CONCATENATE(C$23,K$3)=Matriz!$BE$36,CONCATENATE(Matriz!A36,\" - P3 I2\"),\"\")","v":""},{"$f":"IF(CONCATENATE(C$23,K$3)=Matriz!$BE$108,CONCATENATE(Matriz!A108,\" - P3 I2\"),\"\")","v":""},{"$f":"IF(CONCATENATE(C$23,K$3)=Matriz!$BE$180,CONCATENATE(Matriz!A180,\" - P3 I2\"),\"\")","v":""},{"$f":"IF(CONCATENATE(C$23,K$3)=Matriz!$BE$252,CONCATENATE(Matriz!A252,\" - P3 I2\"),\"\")","v":""},{"$f":"IF(CONCATENATE(C$23,K$3)=Matriz!$BE$324,CONCATENATE(Matriz!A324,\" - P3 I2\"),\"\")","v":""},null,{"$f":"IF(CONCATENATE(C$23,Q$3)=Matriz!$BE$36,CONCATENATE(Matriz!A36,\" - P3 I3\"),\"\")","v":""},{"$f":"IF(CONCATENATE(C$23,Q$3)=Matriz!$BE$108,CONCATENATE(Matriz!A108,\" - P3 I3\"),\"\")","v":""},{"$f":"IF(CONCATENATE(C$23,Q$3)=Matriz!$BE$180,CONCATENATE(Matriz!A180,\" - P3 I3\"),\"\")","v":""},{"$f":"IF(CONCATENATE(C$23,Q$3)=Matriz!$BE$252,CONCATENATE(Matriz!A252,\" - P3 I3\"),\"\")","v":""},{"$f":"IF(CONCATENATE(C$23,Q$3)=Matriz!$BE$324,CONCATENATE(Matriz!A324,\" - P3 I3\"),\"\")","v":""},null,{"$f":"IF(CONCATENATE(C$23,W$3)=Matriz!$BE$36,CONCATENATE(Matriz!A36,\" - P3 I4\"),\"\")","v":""},{"$f":"IF(CONCATENATE(C$23,W$3)=Matriz!$BE$108,CONCATENATE(Matriz!A108,\" - P3 I4\"),\"\")","v":""},{"$f":"IF(CONCATENATE(C$23,W$3)=Matriz!$BE$180,CONCATENATE(Matriz!A180,\" - P3 I4\"),\"\")","v":""},{"$f":"IF(CONCATENATE(C$23,W$3)=Matriz!$BE$252,CONCATENATE(Matriz!A252,\" - P3 I4\"),\"\")","v":""},{"$f":"IF(CONCATENATE(C$23,W$3)=Matriz!$BE$324,CONCATENATE(Matriz!A324,\" - P3 I4\"),\"\")","v":""},null,{"$f":"IF(CONCATENATE(C$23,AC$3)=Matriz!$BE$36,CONCATENATE(Matriz!A36,\" - P3 I5\"),\"\")","v":""},{"$f":"IF(CONCATENATE(C$23,AC$3)=Matriz!$BE$108,CONCATENATE(Matriz!A108,\" - P3 I5\"),\"\")","v":""},{"$f":"IF(CONCATENATE(C$23,AC$3)=Matriz!$BE$180,CONCATENATE(Matriz!A180,\" - P3 I5\"),\"\")","v":""},{"$f":"IF(CONCATENATE(C$23,AC$3)=Matriz!$BE$252,CONCATENATE(Matriz!A252,\" - P3 I5\"),\"\")","v":""},{"$f":"IF(CONCATENATE(C$23,AC$3)=Matriz!$BE$324,CONCATENATE(Matriz!A324,\" - P3 I5\"),\"\")","v":""}]
[{"$nulls":4},{"$f":"IF(CONCATENATE(C$23,E$3)=Matriz!$BE$45,CONCATENATE(Matriz!A45,\" - P3 I1\"),\"\")","v":""},{"$f":"IF(CONCATENATE(C$23,E$3)=Matriz!$BE$117,CONCATENATE(Matriz!A117,\" - P3 I1\"),\"\")","v":""},{"$f":"IF(CONCATENATE(C$23,E$3)=Matriz!$BE$189,CONCATENATE(Matriz!A189,\" - P3 I1\"),\"\")","v":""},{"$f":"IF(CONCATENATE(C$23,E$3)=Matriz!$BE$261,CONCATENATE(Matriz!A261,\" - P3 I1\"),\"\")","v":""},{"$f":"IF(CONCATENATE(C$23,E$3)=Matriz!$BE$333,CONCATENATE(Matriz!A333,\" - P3 I1\"),\"\")","v":""},null,{"$f":"IF(CONCATENATE(C$23,K$3)=Matriz!$BE$45,CONCATENATE(Matriz!A45,\" - P3 I2\"),\"\")","v":""},{"$f":"IF(CONCATENATE(C$23,K$3)=Matriz!$BE$117,CONCATENATE(Matriz!A117,\" - P3 I2\"),\"\")","v":""},{"$f":"IF(CONCATENATE(C$23,K$3)=Matriz!$BE$189,CONCATENATE(Matriz!A189,\" - P3 I2\"),\"\")","v":""},{"$f":"IF(CONCATENATE(C$23,K$3)=Matriz!$BE$261,CONCATENATE(Matriz!A261,\" - P3 I2\"),\"\")","v":""},{"$f":"IF(CONCATENATE(C$23,K$3)=Matriz!$BE$333,CONCATENATE(Matriz!A333,\" - P3 I2\"),\"\")","v":""},null,{"$f":"IF(CONCATENATE(C$23,Q$3)=Matriz!$BE$45,CONCATENATE(Matriz!A45,\" - P3 I3\"),\"\")","v":"R5 - P3 I3"},{"$f":"IF(CONCATENATE(C$23,Q$3)=Matriz!$BE$117,CONCATENATE(Matriz!A117,\" - P3 I3\"),\"\")","v":""},{"$f":"IF(CONCATENATE(C$23,Q$3)=Matriz!$BE$189,CONCATENATE(Matriz!A189,\" - P3 I3\"),\"\")","v":""},{"$f":"IF(CONCATENATE(C$23,Q$3)=Matriz!$BE$261,CONCATENATE(Matriz!A261,\" - P3 I3\"),\"\")","v":""},{"$f":"IF(CONCATENATE(C$23,Q$3)=Matriz!$BE$333,CONCATENATE(Matriz!A333,\" - P3 I3\"),\"\")","v":""},null,{"$f":"IF(CONCATENATE(C$23,W$3)=Matriz!$BE$45,CONCATENATE(Matriz!A45,\" - P3 I4\"),\"\")","v":""},{"$f":"IF(CONCATENATE(C$23,W$3)=Matriz!$BE$117,CONCATENATE(Matriz!A117,\" - P3 I4\"),\"\")","v":"R13 - P3 I4"},{"$f":"IF(CONCATENATE(C$23,W$3)=Matriz!$BE$189,CONCATENATE(Matriz!A189,\" - P3 I4\"),\"\")","v":""},{"$f":"IF(CONCATENATE(C$23,W$3)=Matriz!$BE$261,CONCATENATE(Matriz!A261,\" - P3 I4\"),\"\")","v":""},{"$f":"IF(CONCATENATE(C$23,W$3)=Matriz!$BE$333,CONCATENATE(Matriz!A333,\" - P3 I4\"),\"\")","v":""},null,{"$f":"IF(CONCATENATE(C$23,AC$3)=Matriz!$BE$45,CONCATENATE(Matriz!A45,\" - P3 I5\"),\"\")","v":""},{"$f":"IF(CONCATENATE(C$23,AC$3)=Matriz!$BE$117,CONCATENATE(Matriz!A117,\" - P3 I5\"),\"\")","v":""},{"$f":"IF(CONCATENATE(C$23,AC$3)=Matriz!$BE$189,CONCATENATE(Matriz!A189,\" - P3 I5\"),\"\")","v":""},{"$f":"IF(CONCATENATE(C$23,AC$3)=Matriz!$BE$261,CONCATENATE(Matriz!A261,\" - P3 I5\"),\"\")","v":""},{"$f":"IF(CONCATENATE(C$23,AC$3)=Matriz!$BE$333,CONCATENATE(Matriz!A333,\" - P3 I5\"),\"\")","v":""}]
[{"$nulls":4},{"$f":"IF(CONCATENATE(C$23,E$3)=Matriz!$BE$54,CONCATENATE(Matriz!A54,\" - P3 I1\"),\"\")","v":""},{"$f":"IF(CONCATENATE(C$23,E$3)=Matriz!$BE$126,CONCATENATE(Matriz!A126,\" - P3 I1\"),\"\")","v":""},{"$f":"IF(CONCATENATE(C$23,E$3)=Matriz!$BE$198,CONCATENATE(Matriz!A198,\" - P3 I1\"),\"\")","v":""},{"$f":"IF(CONCATENATE(C$23,E$3)=Matriz!$BE$270,CONCATENATE(Matriz!A270,\" - P3 I1\"),\"\")","v":""},{"$f":"IF(CONCATENATE(C$23,E$3)=Matriz!$BE$342,CONCATENATE(Matriz!A342,\" - P3 I1\"),\"\")","v":""},null,{"$f":"IF(CONCATENATE(C$23,K$3)=Matriz!$BE$54,CONCATENATE(Matriz!A54,\" - P3 I2\"),\"\")","v":""},{"$f":"IF(CONCATENATE(C$23,K$3)=Matriz!$BE$126,CONCATENATE(Matriz!A126,\" - P3 I2\"),\"\")","v":""},{"$f":"IF(CONCATENATE(C$23,K$3)=Matriz!$BE$198,CONCATENATE(Matriz!A198,\" - P3 I2\"),\"\")","v":""},{"$f":"IF(CONCATENATE(C$23,K$3)=Matriz!$BE$270,CONCATENATE(Matriz!A270,\" - P3 I2\"),\"\")","v":""},{"$f":"IF(CONCATENATE(C$23,K$3)=Matriz!$BE$342,CONCATENATE(Matriz!A342,\" - P3 I2\"),\"\")","v":""},null,{"$f":"IF(CONCATENATE(C$23,Q$3)=Matriz!$BE$54,CONCATENATE(Matriz!A54,\" - P3 I3\"),\"\")","v":""},{"$f":"IF(CONCATENATE(C$23,Q$3)=Matriz!$BE$126,CONCATENATE(Matriz!A126,\" - P3 I3\"),\"\")","v":""},{"$f":"IF(CONCATENATE(C$23,Q$3)=Matriz!$BE$198,CONCATENATE(Matriz!A198,\" - P3 I3\"),\"\")","v":""},{"$f":"IF(CONCATENATE(C$23,Q$3)=Matriz!$BE$270,CONCATENATE(Matriz!A270,\" - P3 I3\"),\"\")","v":""},{"$f":"IF(CONCATENATE(C$23,Q$3)=Matriz!$BE$342,CONCATENATE(Matriz!A342,\" - P3 I3\"),\"\")","v":""},null,{"$f":"IF(CONCATENATE(C$23,W$3)=Matriz!$BE$54,CONCATENATE(Matriz!A54,\" - P3 I4\"),\"\")","v":"R6 - P3 I4"},{"$f":"IF(CONCATENATE(C$23,W$3)=Matriz!$BE$126,CONCATENATE(Matriz!A126,\" - P3 I4\"),\"\")","v":""},{"$f":"IF(CONCATENATE(C$23,W$3)=Matriz!$BE$198,CONCATENATE(Matriz!A198,\" - P3 I4\"),\"\")","v":""},{"$f":"IF(CONCATENATE(C$23,W$3)=Matriz!$BE$270,CONCATENATE(Matriz!A270,\" - P3 I4\"),\"\")","v":""},{"$f":"IF(CONCATENATE(C$23,W$3)=Matriz!$BE$342,CONCATENATE(Matriz!A342,\" - P3 I4\"),\"\")","v":""},null,{"$f":"IF(CONCATENATE(C$23,AC$3)=Matriz!$BE$54,CONCATENATE(Matriz!A54,\" - P3 I5\"),\"\")","v":""},{"$f":"IF(CONCATENATE(C$23,AC$3)=Matriz!$BE$126,CONCATENATE(Matriz!A126,\" - P3 I5\"),\"\")","v":""},{"$f":"IF(CONCATENATE(C$23,AC$3)=Matriz!$BE$198,CONCATENATE(Matriz!A198,\" - P3 I5\"),\"\")","v":""},{"$f":"IF(CONCATENATE(C$23,AC$3)=Matriz!$BE$270,CONCATENATE(Matriz!A270,\" - P3 I5\"),\"\")","v":""},{"$f":"IF(CONCATENATE(C$23,AC$3)=Matriz!$BE$342,CONCATENATE(Matriz!A342,\" - P3 I5\"),\"\")","v":""},{"$nulls":6},9,13,{"$f":"AO27*AN27","v":117}]
[{"$nulls":4},{"$f":"IF(CONCATENATE(C$23,E$3)=Matriz!$BE$63,CONCATENATE(Matriz!A63,\" - P3 I1\"),\"\")","v":""},{"$f":"IF(CONCATENATE(C$23,E$3)=Matriz!$BE$135,CONCATENATE(Matriz!A135,\" - P3 I1\"),\"\")","v":""},{"$f":"IF(CONCATENATE(C$23,E$3)=Matriz!$BE$207,CONCATENATE(Matriz!A207,\" - P3 I1\"),\"\")","v":""},{"$f":"IF(CONCATENATE(C$23,E$3)=Matriz!$BE$279,CONCATENATE(Matriz!A279,\" - P3 I1\"),\"\")","v":""},{"$f":"IF(CONCATENATE(C$23,E$3)=Matriz!$BE$351,CONCATENATE(Matriz!A351,\" - P3 I1\"),\"\")","v":""},null,{"$f":"IF(CONCATENATE(C$23,K$3)=Matriz!$BE$63,CONCATENATE(Matriz!A63,\" - P3 I2\"),\"\")","v":""},{"$f":"IF(CONCATENATE(C$23,K$3)=Matriz!$BE$135,CONCATENATE(Matriz!A135,\" - P3 I2\"),\"\")","v":""},{"$f":"IF(CONCATENATE(C$23,K$3)=Matriz!$BE$207,CONCATENATE(Matriz!A207,\" - P3 I2\"),\"\")","v":""},{"$f":"IF(CONCATENATE(C$23,K$3)=Matriz!$BE$279,CONCATENATE(Matriz!A279,\" - P3 I2\"),\"\")","v":""},{"$f":"IF(CONCATENATE(C$23,K$3)=Matriz!$BE$351,CONCATENATE(Matriz!A351,\" - P3 I2\"),\"\")","v":""},null,{"$f":"IF(CONCATENATE(C$23,Q$3)=Matriz!$BE$63,CONCATENATE(Matriz!A63,\" - P3 I3\"),\"\")","v":""},{"$f":"IF(CONCATENATE(C$23,Q$3)=Matriz!$BE$135,CONCATENATE(Matriz!A135,\" - P3 I3\"),\"\")","v":""},{"$f":"IF(CONCATENATE(C$23,Q$3)=Matriz!$BE$207,CONCATENATE(Matriz!A207,\" - P3 I3\"),\"\")","v":""},{"$f":"IF(CONCATENATE(C$23,Q$3)=Matriz!$BE$279,CONCATENATE(Matriz!A279,\" - P3 I3\"),\"\")","v":""},{"$f":"IF(CONCATENATE(C$23,Q$3)=Matriz!$BE$351,CONCATENATE(Matriz!A351,\" - P3 I3\"),\"\")","v":""},null,{"$f":"IF(CONCATENATE(C$23,W$3)=Matriz!$BE$63,CONCATENATE(Matriz!A63,\" - P3 I4\"),\"\")","v":""},{"$f":"IF(CONCATENATE(C$23,W$3)=Matriz!$BE$135,CONCATENATE(Matriz!A135,\" - P3 I4\"),\"\")","v":"R15 - P3 I4"},{"$f":"IF(CONCATENATE(C$23,W$3)=Matriz!$BE$207,CONCATENATE(Matriz!A207,\" - P3 I4\"),\"\")","v":""},{"$f":"IF(CONCATENATE(C$23,W$3)=Matriz!$BE$279,CONCATENATE(Matriz!A279,\" - P3 I4\"),\"\")","v":""},{"$f":"IF(CONCATENATE(C$23,W$3)=Matriz!$BE$351,CONCATENATE(Matriz!A351,\" - P3 I4\"),\"\")","v":""},null,{"$f":"IF(CONCATENATE(C$23,AC$3)=Matriz!$BE$63,CONCATENATE(Matriz!A63,\" - P3 I5\"),\"\")","v":""},{"$f":"IF(CONCATENATE(C$23,AC$3)=Matriz!$BE$135,CONCATENATE(Matriz!A135,\" - P3 I5\"),\"\")","v":""},{"$f":"IF(CONCATENATE(C$23,AC$3)=Matriz!$BE$207,CONCATENATE(Matriz!A207,\" - P3 I5\"),\"\")","v":""},{"$f":"IF(CONCATENATE(C$23,AC$3)=Matriz!$BE$279,CONCATENATE(Matriz!A279,\" - P3 I5\"),\"\")","v":""},{"$f":"IF(CONCATENATE(C$23,AC$3)=Matriz!$BE$351,CONCATENATE(Matriz!A351,\" - P3 I5\"),\"\")","v":""},{"$nulls":6},9,14,126]
[{"$nulls":4},{"$f":"IF(CONCATENATE(C$23,E$3)=Matriz!$BE$72,CONCATENATE(Matriz!A72,\" - P3 I1\"),\"\")","v":""},{"$f":"IF(CONCATENATE(C$23,E$3)=Matriz!$BE$144,CONCATENATE(Matriz!A144,\" - P3 I1\"),\"\")","v":""},{"$f":"IF(CONCATENATE(C$23,E$3)=Matriz!$BE$216,CONCATENATE(Matriz!A216,\" - P3 I1\"),\"\")","v":""},{"$f":"IF(CONCATENATE(C$23,E$3)=Matriz!$BE$288,CONCATENATE(Matriz!A288,\" - P3 I1\"),\"\")","v":""},{"$f":"IF(CONCATENATE(C$23,E$3)=Matriz!$BE$360,CONCATENATE(Matriz!A360,\" - P3 I1\"),\"\")","v":""},null,{"$f":"IF(CONCATENATE(C$23,K$3)=Matriz!$BE$72,CONCATENATE(Matriz!A72,\" - P3 I2\"),\"\")","v":""},{"$f":"IF(CONCATENATE(C$23,K$3)=Matriz!$BE$144,CONCATENATE(Matriz!A144,\" - P3 I2\"),\"\")","v":""},{"$f":"IF(CONCATENATE(C$23,K$3)=Matriz!$BE$216,CONCATENATE(Matriz!A216,\" - P3 I2\"),\"\")","v":""},{"$f":"IF(CONCATENATE(C$23,K$3)=Matriz!$BE$288,CONCATENATE(Matriz!A288,\" - P3 I2\"),\"\")","v":""},{"$f":"IF(CONCATENATE(C$23,K$3)=Matriz!$BE$360,CONCATENATE(Matriz!A360,\" - P3 I2\"),\"\")","v":""},null,{"$f":"IF(CONCATENATE(C$23,Q$3)=Matriz!$BE$72,CONCATENATE(Matriz!A72,\" - P3 I3\"),\"\")","v":""},{"$f":"IF(CONCATENATE(C$23,Q$3)=Matriz!$BE$144,CONCATENATE(Matriz!A144,\" - P3 I3\"),\"\")","v":""},{"$f":"IF(CONCATENATE(C$23,Q$3)=Matriz!$BE$216,CONCATENATE(Matriz!A216,\" - P3 I3\"),\"\")","v":""},{"$f":"IF(CONCATENATE(C$23,Q$3)=Matriz!$BE$288,CONCATENATE(Matriz!A288,\" - P3 I3\"),\"\")","v":""},{"$f":"IF(CONCATENATE(C$23,Q$3)=Matriz!$BE$360,CONCATENATE(Matriz!A360,\" - P3 I3\"),\"\")","v":""},null,{"$f":"IF(CONCATENATE(C$23,W$3)=Matriz!$BE$72,CONCATENATE(Matriz!A72,\" - P3 I4\"),\"\")","v":""},{"$f":"IF(CONCATENATE(C$23,W$3)=Matriz!$BE$144,CONCATENATE(Matriz!A144,\" - P3 I4\"),\"\")","v":"R16 - P3 I4"},{"$f":"IF(CONCATENATE(C$23,W$3)=Matriz!$BE$216,CONCATENATE(Matriz!A216,\" - P3 I4\"),\"\")","v":""},{"$f":"IF(CONCATENATE(C$23,W$3)=Matriz!$BE$288,CONCATENATE(Matriz!A288,\" - P3 I4\"),\"\")","v":""},{"$f":"IF(CONCATENATE(C$23,W$3)=Matriz!$BE$360,CONCATENATE(Matriz!A360,\" - P3 I4\"),\"\")","v":""},null,{"$f":"IF(CONCATENATE(C$23,AC$3)=Matriz!$BE$72,CONCATENATE(Matriz!A72,\" - P3 I5\"),\"\")","v":""},{"$f":"IF(CONCATENATE(C$23,AC$3)=Matriz!$BE$144,CONCATENATE(Matriz!A144,\" - P3 I5\"),\"\")","v":""},{"$f":"IF(CONCATENATE(C$23,AC$3)=Matriz!$BE$216,CONCATENATE(Matriz!A216,\" - P3 I5\"),\"\")","v":""},{"$f":"IF(CONCATENATE(C$23,AC$3)=Matriz!$BE$288,CONCATENATE(Matriz!A288,\" - P3 I5\"),\"\")","v":""},{"$f":"IF(CONCATENATE(C$23,AC$3)=Matriz!$BE$360,CONCATENATE(Matriz!A360,\" - P3 I5\"),\"\")","v":""},{"$nulls":6},9,15,135]
[{"$nulls":4},{"$f":"IF(CONCATENATE(C$31,E$3)=Matriz!$BE$9,CONCATENATE(Matriz!A9,\" - P4 I1\"),\"\")","v":""},{"$f":"IF(CONCATENATE(C$31,E$3)=Matriz!$BE$54,CONCATENATE(Matriz!A54,\" - P4 I1\"),\"\")","v":""},{"$f":"IF(CONCATENATE(C$31,E$3)=Matriz!$BE$99,CONCATENATE(Matriz!A99,\" - P4 I1\"),\"\")","v":""},{"$f":"IF(CONCATENATE(C$31,E$3)=Matriz!$BE$144,CONCATENATE(Matriz!A144,\" - P4 I1\"),\"\")","v":""},null,{"$f":"IF(CONCATENATE(C$31,E$3)=Matriz!$BE$189,CONCATENATE(Matriz!A189,\" - P4 I1\"),\"\")","v":""},{"$f":"IF(CONCATENATE(C$31,K$3)=Matriz!$BE$9,CONCATENATE(Matriz!A9,\" - P4 I2\"),\"\")","v":""},{"$f":"IF(CONCATENATE(C$31,K$3)=Matriz!$BE$54,CONCATENATE(Matriz!A54,\" - P4 I2\"),\"\")","v":""},{"$f":"IF(CONCATENATE(C$31,K$3)=Matriz!$BE$99,CONCATENATE(Matriz!A99,\" - P4 I2\"),\"\")","v":""},{"$f":"IF(CONCATENATE(C$31,K$3)=Matriz!$BE$144,CONCATENATE(Matriz!A144,\" - P4 I2\"),\"\")","v":""},{"$f":"IF(CONCATENATE(C$31,K$3)=Matriz!$BE$189,CONCATENATE(Matriz!A189,\" - P4 I2\"),\"\")","v":""},null,{"$f":"IF(CONCATENATE(C$31,Q$3)=Matriz!$BE$9,CONCATENATE(Matriz!A9,\" - P4 I3\"),\"\")","v":""},{"$f":"IF(CONCATENATE(C$31,Q$3)=Matriz!$BE$54,CONCATENATE(Matriz!A54,\" - P4 I3\"),\"\")","v":""},{"$f":"IF(CONCATENATE(D$31,R$3)=Matriz!$BE$99,CONCATENATE(Matriz!B99,\" - P4 I3\"),\"\")","v":""},{"$f":"IF(CONCATENATE(D$31,R$3)=Matriz!$BE$144,CONCATENATE(Matriz!B144,\" - P4 I3\"),\"\")","v":""},{"$f":"IF(CONCATENATE(D$31,R$3)=Matriz!$BE$189,CONCATENATE(Matriz!B189,\" - P4 I3\"),\"\")","v":""},null,{"$f":"IF(CONCATENATE(C$31,W$3)=Matriz!$BE$9,CONCATENATE(Matriz!A9,\" - P4 I4\"),\"\")","v":""},{"$f":"IF(CONCATENATE(C$31,W$3)=Matriz!$BE$54,CONCATENATE(Matriz!A54,\" - P4 I4\"),\"\")","v":""},{"$f":"IF(CONCATENATE(C$31,W$3)=Matriz!$BE$99,CONCATENATE(Matriz!A99,\" - P4 I4\"),\"\")","v":""},{"$f":"IF(CONCATENATE(C$31,W$3)=Matriz!$BE$144,CONCATENATE(Matriz!A144,\" - P4 I4\"),\"\")","v":""},{"$f":"IF(CONCATENATE(C$31,W$3)=Matriz!$BE$189,CONCATENATE(Matriz!A189,\" - P4 I4\"),\"\")","v":""},null,{"$f":"IF(CONCATENATE(C$31,AC$3)=Matriz!$BE$9,CONCATENATE(Matriz!A9,\" - P4 I5\"),\"\")","v":""},{"$f":"IF(CONCATENATE(C$31,AC$3)=Matriz!$BE$54,CONCATENATE(Matriz!A54,\" - P4 I5\"),\"\")","v":""},{"$f":"IF(CONCATENATE(C$31,AC$3)=Matriz!$BE$99,CONCATENATE(Matriz!A99,\" - P4 I5\"),\"\")","v":""},{"$f":"IF(CONCATENATE(C$31,AC$3)=Matriz!$BE$144,CONCATENATE(Matriz!A144,\" - P4 I5\"),\"\")","v":""},null,{"$f":"IF(CONCATENATE(C$31,AC$3)=Matriz!$BE$189,CONCATENATE(Matriz!A189,\" - P4 I5\"),\"\")","v":""},{"$nulls":5},9,16,144]
[null,null,4,"PROBABLE",{"$f":"IF(CONCATENATE(C$31,E$3)=Matriz!$BE$18,CONCATENATE(Matriz!A18,\" - P4 I1\"),\"\")","v":""},{"$f":"IF(CONCATENATE(C$31,E$3)=Matriz!$BE$63,CONCATENATE(Matriz!A63,\" - P4 I1\"),\"\")","v":""},{"$f":"IF(CONCATENATE(C$31,E$3)=Matriz!$BE$108,CONCATENATE(Matriz!A108,\" - P4 I1\"),\"\")","v":""},{"$f":"IF(CONCATENATE(C$31,E$3)=Matriz!$BE$153,CONCATENATE(Matriz!A153,\" - P4 I1\"),\"\")","v":""},null,{"$f":"IF(CONCATENATE(C$31,E$3)=Matriz!$BE$198,CONCATENATE(Matriz!A198,\" - P4 I1\"),\"\")","v":""},{"$f":"IF(CONCATENATE(C$31,K$3)=Matriz!$BE$18,CONCATENATE(Matriz!A18,\" - P4 I2\"),\"\")","v":""},{"$f":"IF(CONCATENATE(C$31,K$3)=Matriz!$BE$63,CONCATENATE(Matriz!A63,\" - P4 I2\"),\"\")","v":""},{"$f":"IF(CONCATENATE(C$31,K$3)=Matriz!$BE$108,CONCATENATE(Matriz!A108,\" - P4 I2\"),\"\")","v":""},{"$f":"IF(CONCATENATE(C$31,K$3)=Matriz!$BE$153,CONCATENATE(Matriz!A153,\" - P4 I2\"),\"\")","v":""},{"$f":"IF(CONCATENATE(C$31,K$3)=Matriz!$BE$198,CONCATENATE(Matriz!A198,\" - P4 I2\"),\"\")","v":""},null,{"$f":"IF(CONCATENATE(C$31,Q$3)=Matriz!$BE$18,CONCATENATE(Matriz!A18,\" - P4 I3\"),\"\")","v":""},{"$f":"IF(CONCATENATE(C$31,Q$3)=Matriz!$BE$63,CONCATENATE(Matriz!A63,\" - P4 I3\"),\"\")","v":""},{"$f":"IF(CONCATENATE(D$31,R$3)=Matriz!$BE$108,CONCATENATE(Matriz!B108,\" - P4 I3\"),\"\")","v":""},{"$f":"IF(CONCATENATE(D$31,R$3)=Matriz!$BE$153,CONCATENATE(Matriz!B153,\" - P4 I3\"),\"\")","v":""},{"$f":"IF(CONCATENATE(D$31,R$3)=Matriz!$BE$198,CONCATENATE(Matriz!B198,\" - P4 I3\"),\"\")","v":""},null,{"$f":"IF(CONCATENATE(C$31,W$3)=Matriz!$BE$18,CONCATENATE(Matriz!A18,\" - P4 I4\"),\"\")","v":""},{"$f":"IF(CONCATENATE(C$31,W$3)=Matriz!$BE$63,CONCATENATE(Matriz!A63,\" - P4 I4\"),\"\")","v":""},{"$f":"IF(CONCATENATE(C$31,W$3)=Matriz!$BE$108,CONCATENATE(Matriz!A108,\" - P4 I4\"),\"\")","v":"R12 - P4 I4"},{"$f":"IF(CONCATENATE(C$31,W$3)=Matriz!$BE$153,CONCATENATE(Matriz!A153,\" - P4 I4\"),\"\")","v":""},{"$f":"IF(CONCATENATE(C$31,W$3)=Matriz!$BE$198,CONCATENATE(Matriz!A198,\" - P4 I4\"),\"\")","v":""},null,{"$f":"IF(CONCATENATE(C$31,AC$3)=Matriz!$BE$18,CONCATENATE(Matriz!A18,\" - P4 I5\"),\"\")","v":""},{"$f":"IF(CONCATENATE(C$31,AC$3)=Matriz!$BE$63,CONCATENATE(Matriz!A63,\" - P4 I5\"),\"\")","v":""},{"$f":"IF(CONCATENATE(C$31,AC$3)=Matriz!$BE$108,CONCATENATE(Matriz!A108,\" - P4 I5\"),\"\")","v":""},{"$f":"IF(CONCATENATE(C$31,AC$3)=Matriz!$BE$153,CONCATENATE(Matriz!A153,\" - P4 I5\"),\"\")","v":""},null,{"$f":"IF(CONCATENATE(C$31,AC$3)=Matriz!$BE$198,CONCATENATE(Matriz!A198,\" - P4 I5\"),\"\")","v":""},{"$nulls":5},9,17,153]
[{"$nulls":4},{"$f":"IF(CONCATENATE(C$31,E$3)=Matriz!$BE$27,CONCATENATE(Matriz!A27,\" - P4 I1\"),\"\")","v":""},{"$f":"IF(CONCATENATE(C$31,E$3)=Matriz!$BE$72,CONCATENATE(Matriz!A72,\" - P4 I1\"),\"\")","v":""},{"$f":"IF(CONCATENATE(C$31,E$3)=Matriz!$BE$117,CONCATENATE(Matriz!A117,\" - P4 I1\"),\"\")","v":""},{"$f":"IF(CONCATENATE(C$31,E$3)=Matriz!$BE$162,CONCATENATE(Matriz!A162,\" - P4 I1\"),\"\")","v":""},null,{"$f":"IF(CONCATENATE(C$31,E$3)=Matriz!$BE$207,CONCATENATE(Matriz!A207,\" - P4 I1\"),\"\")","v":""},{"$f":"IF(CONCATENATE(C$31,K$3)=Matriz!$BE$27,CONCATENATE(Matriz!A27,\" - P4 I2\"),\"\")","v":""},{"$f":"IF(CONCATENATE(C$31,K$3)=Matriz!$BE$72,CONCATENATE(Matriz!A72,\" - P4 I2\"),\"\")","v":""},{"$f":"IF(CONCATENATE(C$31,K$3)=Matriz!$BE$117,CONCATENATE(Matriz!A117,\" - P4 I2\"),\"\")","v":""},{"$f":"IF(CONCATENATE(C$31,K$3)=Matriz!$BE$162,CONCATENATE(Matriz!A162,\" - P4 I2\"),\"\")","v":""},{"$f":"IF(CONCATENATE(C$31,K$3)=Matriz!$BE$207,CONCATENATE(Matriz!A207,\" - P4 I2\"),\"\")","v":""},null,{"$f":"IF(CONCATENATE(C$31,Q$3)=Matriz!$BE$27,CONCATENATE(Matriz!A27,\" - P4 I3\"),\"\")","v":""},{"$f":"IF(CONCATENATE(C$31,Q$3)=Matriz!$BE$72,CONCATENATE(Matriz!A72,\" - P4 I3\"),\"\")","v":""},{"$f":"IF(CONCATENATE(D$31,R$3)=Matriz!$BE$117,CONCATENATE(Matriz!B117,\" - P4 I3\"),\"\")","v":""},{"$f":"IF(CONCATENATE(D$31,R$3)=Matriz!$BE$162,CONCATENATE(Matriz!B162,\" - P4 I3\"),\"\")","v":""},{"$f":"IF(CONCATENATE(D$31,R$3)=Matriz!$BE$207,CONCATENATE(Matriz!B207,\" - P4 I3\"),\"\")","v":""},null,{"$f":"IF(CONCATENATE(C$31,W$3)=Matriz!$BE$27,CONCATENATE(Matriz!A27,\" - P4 I4\"),\"\")","v":""},{"$f":"IF(CONCATENATE(C$31,W$3)=Matriz!$BE$72,CONCATENATE(Matriz!A72,\" - P4 I4\"),\"\")","v":""},{"$f":"IF(CONCATENATE(C$31,W$3)=Matriz!$BE$117,CONCATENATE(Matriz!A117,\" - P4 I4\"),\"\")","v":""},{"$f":"IF(CONCATENATE(C$31,W$3)=Matriz!$BE$162,CONCATENATE(Matriz!A162,\" - P4 I4\"),\"\")","v":""},{"$f":"IF(CONCATENATE(C$31,W$3)=Matriz!$BE$207,CONCATENATE(Matriz!A207,\" - P4 I4\"),\"\")","v":""},null,{"$f":"IF(CONCATENATE(C$31,AC$3)=Matriz!$BE$27,CONCATENATE(Matriz!A27,\" - P4 I5\"),\"\")","v":""},{"$f":"IF(CONCATENATE(C$31,AC$3)=Matriz!$BE$72,CONCATENATE(Matriz!A72,\" - P4 I5\"),\"\")","v":""},{"$f":"IF(CONCATENATE(C$31,AC$3)=Matriz!$BE$117,CONCATENATE(Matriz!A117,\" - P4 I5\"),\"\")","v":""},{"$f":"IF(CONCATENATE(C$31,AC$3)=Matriz!$BE$162,CONCATENATE(Matriz!A162,\" - P4 I5\"),\"\")","v":""},null,{"$f":"IF(CONCATENATE(C$31,AC$3)=Matriz!$BE$207,CONCATENATE(Matriz!A207,\" - P4 I5\"),\"\")","v":""},{"$nulls":5},9,18,162]
[{"$nulls":4},{"$f":"IF(CONCATENATE(C$31,E$3)=Matriz!$BE$36,CONCATENATE(Matriz!A36,\" - P4 I1\"),\"\")","v":""},{"$f":"IF(CONCATENATE(C$31,E$3)=Matriz!$BE$81,CONCATENATE(Matriz!A81,\" - P4 I1\"),\"\")","v":""},{"$f":"IF(CONCATENATE(C$31,E$3)=Matriz!$BE$126,CONCATENATE(Matriz!A126,\" - P4 I1\"),\"\")","v":""},{"$f":"IF(CONCATENATE(C$31,E$3)=Matriz!$BE$171,CONCATENATE(Matriz!A171,\" - P4 I1\"),\"\")","v":""},null,{"$f":"IF(CONCATENATE(C$31,E$3)=Matriz!$BE$216,CONCATENATE(Matriz!A216,\" - P4 I1\"),\"\")","v":""},{"$f":"IF(CONCATENATE(C$31,K$3)=Matriz!$BE$36,CONCATENATE(Matriz!C36,\" - P4 I2\"),\"\")","v":""},{"$f":"IF(CONCATENATE(C$31,K$3)=Matriz!$BE$81,CONCATENATE(Matriz!A81,\" - P4 I2\"),\"\")","v":""},{"$f":"IF(CONCATENATE(C$31,K$3)=Matriz!$BE$126,CONCATENATE(Matriz!A126,\" - P4 I2\"),\"\")","v":""},{"$f":"IF(CONCATENATE(C$31,K$3)=Matriz!$BE$171,CONCATENATE(Matriz!A171,\" - P4 I2\"),\"\")","v":""},{"$f":"IF(CONCATENATE(C$31,K$3)=Matriz!$BE$216,CONCATENATE(Matriz!A216,\" - P4 I2\"),\"\")","v":""},null,{"$f":"IF(CONCATENATE(C$31,Q$3)=Matriz!$BE$36,CONCATENATE(Matriz!A36,\" - P4 I3\"),\"\")","v":""},{"$f":"IF(CONCATENATE(D$31,R$3)=Matriz!$BE$81,CONCATENATE(Matriz!B81,\" - P4 I3\"),\"\")","v":""},{"$f":"IF(CONCATENATE(D$31,R$3)=Matriz!$BE$126,CONCATENATE(Matriz!B126,\" - P4 I3\"),\"\")","v":""},{"$f":"IF(CONCATENATE(D$31,R$3)=Matriz!$BE$171,CONCATENATE(Matriz!B171,\" - P4 I3\"),\"\")","v":""},{"$f":"IF(CONCATENATE(D$31,R$3)=Matriz!$BE$216,CONCATENATE(Matriz!B216,\" - P4 I3\"),\"\")","v":""},null,{"$f":"IF(CONCATENATE(C$31,W$3)=Matriz!$BE$36,CONCATENATE(Matriz!A36,\" - P4 I4\"),\"\")","v":""},{"$f":"IF(CONCATENATE(C$31,W$3)=Matriz!$BE$81,CONCATENATE(Matriz!A81,\" - P4 I4\"),\"\")","v":""},{"$f":"IF(CONCATENATE(C$31,W$3)=Matriz!$BE$126,CONCATENATE(Matriz!A126,\" - P4 I4\"),\"\")","v":""},{"$f":"IF(CONCATENATE(C$31,W$3)=Matriz!$BE$171,CONCATENATE(Matriz!A171,\" - P4 I4\"),\"\")","v":""},{"$f":"IF(CONCATENATE(C$31,W$3)=Matriz!$BE$216,CONCATENATE(Matriz!A216,\" - P4 I4\"),\"\")","v":""},null,{"$f":"IF(CONCATENATE(C$31,AC$3)=Matriz!$BE$36,CONCATENATE(Matriz!A36,\" - P4 I5\"),\"\")","v":""},{"$f":"IF(CONCATENATE(C$31,AC$3)=Matriz!$BE$81,CONCATENATE(Matriz!A81,\" - P4 I5\"),\"\")","v":""},{"$f":"IF(CONCATENATE(C$31,AC$3)=Matriz!$BE$126,CONCATENATE(Matriz!A126,\" - P4 I5\"),\"\")","v":""},{"$f":"IF(CONCATENATE(C$31,AC$3)=Matriz!$BE$171,CONCATENATE(Matriz!A171,\" - P4 I5\"),\"\")","v":""},null,{"$f":"IF(CONCATENATE(C$31,AC$3)=Matriz!$BE$216,CONCATENATE(Matriz!A216,\" - P4 I5\"),\"\")","v":""},{"$nulls":5},9,19,171]
[{"$nulls":4},{"$f":"IF(CONCATENATE(C$31,E$3)=Matriz!$BE$45,CONCATENATE(Matriz!A45,\" - P4 I1\"),\"\")","v":""},{"$f":"IF(CONCATENATE(C$31,E$3)=Matriz!$BE$90,CONCATENATE(Matriz!A90,\" - P4 I1\"),\"\")","v":""},{"$f":"IF(CONCATENATE(C$31,E$3)=Matriz!$BE$135,CONCATENATE(Matriz!A135,\" - P4 I1\"),\"\")","v":""},{"$f":"IF(CONCATENATE(C$31,E$3)=Matriz!$BE$180,CONCATENATE(Matriz!A180,\" - P4 I1\"),\"\")","v":""},null,{"$f":"IF(CONCATENATE(C$31,E$3)=Matriz!$BE$225,CONCATENATE(Matriz!A225,\" - P4 I1\"),\"\")","v":""},{"$f":"IF(CONCATENATE(C$31,K$3)=Matriz!$BE$45,CONCATENATE(Matriz!A45,\" - P4 I2\"),\"\")","v":""},{"$f":"IF(CONCATENATE(C$31,K$3)=Matriz!$BE$90,CONCATENATE(Matriz!A90,\" - P4 I2\"),\"\")","v":""},{"$f":"IF(CONCATENATE(C$31,K$3)=Matriz!$BE$135,CONCATENATE(Matriz!A135,\" - P4 I2\"),\"\")","v":""},{"$f":"IF(CONCATENATE(C$31,K$3)=Matriz!$BE$180,CONCATENATE(Matriz!A180,\" - P4 I2\"),\"\")","v":""},{"$f":"IF(CONCATENATE(C$31,K$3)=Matriz!$BE$225,CONCATENATE(Matriz!A225,\" - P4 I2\"),\"\")","v":""},null,{"$f":"IF(CONCATENATE(C$31,Q$3)=Matriz!$BE$45,CONCATENATE(Matriz!A45,\" - P4 I3\"),\"\")","v":""},{"$f":"IF(CONCATENATE(D$31,R$3)=Matriz!$BE$90,CONCATENATE(Matriz!B90,\" - P4 I3\"),\"\")","v":""},{"$f":"IF(CONCATENATE(D$31,R$3)=Matriz!$BE$135,CONCATENATE(Matriz!B135,\" - P4 I3\"),\"\")","v":""},{"$f":"IF(CONCATENATE(D$31,R$3)=Matriz!$BE$180,CONCATENATE(Matriz!B180,\" - P4 I3\"),\"\")","v":""},{"$f":"IF(CONCATENATE(D$31,R$3)=Matriz!$BE$225,CONCATENATE(Matriz!B225,\" - P4 I3\"),\"\")","v":""},null,{"$f":"IF(CONCATENATE(C$31,W$3)=Matriz!$BE$45,CONCATENATE(Matriz!A45,\" - P4 I4\"),\"\")","v":""},{"$f":"IF(CONCATENATE(C$31,W$3)=Matriz!$BE$90,CONCATENATE(Matriz!A90,\" - P4 I4\"),\"\")","v":""},{"$f":"IF(CONCATENATE(C$31,W$3)=Matriz!$BE$135,CONCATENATE(Matriz!A135,\" - P4 I4\"),\"\")","v":""},{"$f":"IF(CONCATENATE(C$31,W$3)=Matriz!$BE$180,CONCATENATE(Matriz!A180,\" - P4 I4\"),\"\")","v":""},{"$f":"IF(CONCATENATE(C$31,W$3)=Matriz!$BE$225,CONCATENATE(Matriz!A225,\" - P4 I4\"),\"\")","v":""},null,{"$f":"IF(CONCATENATE(C$31,AC$3)=Matriz!$BE$45,CONCATENATE(Matriz!A45,\" - P4 I5\"),\"\")","v":""},{"$f":"IF(CONCATENATE(C$31,AC$3)=Matriz!$BE$90,CONCATENATE(Matriz!A90,\" - P4 I5\"),\"\")","v":""},{"$f":"IF(CONCATENATE(C$31,AC$3)=Matriz!$BE$135,CONCATENATE(Matriz!A135,\" - P4 I5\"),\"\")","v":""},{"$f":"IF(CONCATENATE(C$31,AC$3)=Matriz!$BE$180,CONCATENATE(Matriz!A180,\" - P4 I5\"),\"\")","v":""},null,{"$f":"IF(CONCATENATE(C$31,AC$3)=Matriz!$BE$225,CONCATENATE(Matriz!A225,\" - P4 I5\"),\"\")","v":""},{"$nulls":5},9,20,180]
[{"$nulls":4},{"$f":"IF(CONCATENATE(C$36,E$3)=Matriz!$BE$9,CONCATENATE(Matriz!A$9,\" - P5 I1\"),\"\")","v":""},{"$f":"IF(CONCATENATE($C$36,E$3)=Matriz!$BE$54,CONCATENATE(Matriz!A$54,\" - P5 I1\"),\"\")","v":""},{"$f":"IF(CONCATENATE($C$36,E$3)=Matriz!$BE$99,CONCATENATE(Matriz!A$99,\" - P5 I1\"),\"\")","v":""},{"$f":"IF(CONCATENATE($C$36,E$3)=Matriz!$BE$144,CONCATENATE(Matriz!A$144,\" - P5 I1\"),\"\")","v":""},null,{"$f":"IF(CONCATENATE($C$36,E$3)=Matriz!$BE$189,CONCATENATE(Matriz!A$189,\" - P5 I1\"),\"\")","v":""},{"$f":"IF(CONCATENATE(C$36,K$3)=Matriz!$BE$9,CONCATENATE(Matriz!A$9,\" - P5 I2\"),\"\")","v":""},{"$f":"IF(CONCATENATE($C$36,K$3)=Matriz!$BE$54,CONCATENATE(Matriz!A$54,\" - P5 I2\"),\"\")","v":""},{"$f":"IF(CONCATENATE($C$36,K$3)=Matriz!$BE$99,CONCATENATE(Matriz!A$99,\" - P5 I2\"),\"\")","v":""},{"$f":"IF(CONCATENATE($C$36,K$3)=Matriz!$BE$144,CONCATENATE(Matriz!A$144,\" - P5 I2\"),\"\")","v":""},{"$f":"IF(CONCATENATE($C$36,K$3)=Matriz!$BE$189,CONCATENATE(Matriz!A$189,\" - P5 I2\"),\"\")","v":""},null,{"$f":"IF(CONCATENATE(C$36,Q$3)=Matriz!$BE$9,CONCATENATE(Matriz!A$9,\" - P5 I3\"),\"\")","v":""},{"$f":"IF(CONCATENATE($C$36,Q$3)=Matriz!$BE$54,CONCATENATE(Matriz!A$54,\" - P5 I3\"),\"\")","v":""},{"$f":"IF(CONCATENATE($C$36,Q$3)=Matriz!$BE$99,CONCATENATE(Matriz!A$99,\" - P5 I3\"),\"\")","v":""},{"$f":"IF(CONCATENATE($C$36,Q$3)=Matriz!$BE$144,CONCATENATE(Matriz!A$144,\" - P5 I3\"),\"\")","v":""},{"$f":"IF(CONCATENATE($C$36,Q$3)=Matriz!$BE$189,CONCATENATE(Matriz!A$189,\" - P5 I3\"),\"\")","v":""},null,{"$f":"IF(CONCATENATE($C$36,W$3)=Matriz!$BE$9,CONCATENATE(Matriz!A$9,\" - P5 I4\"),\"\")","v":""},{"$f":"IF(CONCATENATE($C$36,W$3)=Matriz!$BE$54,CONCATENATE(Matriz!A$54,\" - P5 I4\"),\"\")","v":""},{"$f":"IF(CONCATENATE($C$36,W$3)=Matriz!$BE$99,CONCATENATE(Matriz!A$99,\" - P5 I4\"),\"\")","v":""},{"$f":"IF(CONCATENATE($C$36,W$3)=Matriz!$BE$144,CONCATENATE(Matriz!A$144,\" - P5 I4\"),\"\")","v":""},{"$f":"IF(CONCATENATE($C$36,W$3)=Matriz!$BE$189,CONCATENATE(Matriz!A$189,\" - P5 I4\"),\"\")","v":""},null,{"$f":"IF(CONCATENATE($C$36,AC$3)=Matriz!$BE$9,CONCATENATE(Matriz!A$9,\" - P5 I5\"),\"\")","v":""},{"$f":"IF(CONCATENATE($C$36,AC$3)=Matriz!$BE$54,CONCATENATE(Matriz!A$54,\" - P5 I5\"),\"\")","v":""},{"$f":"IF(CONCATENATE($C$36,AC$3)=Matriz!$BE$99,CONCATENATE(Matriz!A$99,\" - P5 I5\"),\"\")","v":""},{"$f":"IF(CONCATENATE($C$36,AC$3)=Matriz!$BE$144,CONCATENATE(Matriz!A$144,\" - P5 I5\"),\"\")","v":""},null,{"$f":"IF(CONCATENATE($C$36,AC$3)=Matriz!$BE$189,CONCATENATE(Matriz!A$189,\" - P5 I5\"),\"\")","v":"R21 - P5 I5"},{"$nulls":5},9,21,189]
[null,null,5,"CASI SEGURO",{"$f":"IF(CONCATENATE($C$36,E$3)=Matriz!$BE$18,CONCATENATE(Matriz!A$18,\" - P5 I1\"),\"\")","v":""},{"$f":"IF(CONCATENATE($C$36,E$3)=Matriz!$BE$63,CONCATENATE(Matriz!A$63,\" - P5 I1\"),\"\")","v":""},{"$f":"IF(CONCATENATE($C$36,E$3)=Matriz!$BE$108,CONCATENATE(Matriz!A$108,\" - P5 I1\"),\"\")","v":""},{"$f":"IF(CONCATENATE($C$36,E$3)=Matriz!$BE$153,CONCATENATE(Matriz!A$153,\" - P5 I1\"),\"\")","v":""},null,{"$f":"IF(CONCATENATE($C$36,E$3)=Matriz!$BE$198,CONCATENATE(Matriz!A$198,\" - P5 I1\"),\"\")","v":""},{"$f":"IF(CONCATENATE($C$36,K$3)=Matriz!$BE$18,CONCATENATE(Matriz!A$18,\" - P5 I2\"),\"\")","v":""},{"$f":"IF(CONCATENATE($C$36,K$3)=Matriz!$BE$63,CONCATENATE(Matriz!A$63,\" - P5 I2\"),\"\")","v":""},{"$f":"IF(CONCATENATE($C$36,K$3)=Matriz!$BE$108,CONCATENATE(Matriz!A$108,\" - P5 I2\"),\"\")","v":""},{"$f":"IF(CONCATENATE($C$36,K$3)=Matriz!$BE$153,CONCATENATE(Matriz!A$153,\" - P5 I2\"),\"\")","v":"R17 - P5 I2"},{"$f":"IF(CONCATENATE($C$36,K$3)=Matriz!$BE$198,CONCATENATE(Matriz!A$198,\" - P5 I2\"),\"\")","v":""},null,{"$f":"IF(CONCATENATE($C$36,Q$3)=Matriz!$BE$18,CONCATENATE(Matriz!A$18,\" - P5 I3\"),\"\")","v":""},{"$f":"IF(CONCATENATE($C$36,Q$3)=Matriz!$BE$63,CONCATENATE(Matriz!A$63,\" - P5 I3\"),\"\")","v":""},{"$f":"IF(CONCATENATE($C$36,Q$3)=Matriz!$BE$108,CONCATENATE(Matriz!A$108,\" - P5 I3\"),\"\")","v":""},{"$f":"IF(CONCATENATE($C$36,Q$3)=Matriz!$BE$153,CONCATENATE(Matriz!A$153,\" - P5 I3\"),\"\")","v":""},{"$f":"IF(CONCATENATE($C$36,Q$3)=Matriz!$BE$198,CONCATENATE(Matriz!A$198,\" - P5 I3\"),\"\")","v":""},null,{"$f":"IF(CONCATENATE($C$36,W$3)=Matriz!$BE$18,CONCATENATE(Matriz!A$18,\" - P5 I4\"),\"\")","v":""},{"$f":"IF(CONCATENATE($C$36,W$3)=Matriz!$BE$63,CONCATENATE(Matriz!A$63,\" - P5 I4\"),\"\")","v":""},{"$f":"IF(CONCATENATE($C$36,W$3)=Matriz!$BE$108,CONCATENATE(Matriz!A$108,\" - P5 I4\"),\"\")","v":""},{"$f":"IF(CONCATENATE($C$36,W$3)=Matriz!$BE$153,CONCATENATE(Matriz!A$153,\" - P5 I4\"),\"\")","v":""},{"$f":"IF(CONCATENATE($C$36,W$3)=Matriz!$BE$198,CONCATENATE(Matriz!A$198,\" - P5 I4\"),\"\")","v":""},null,{"$f":"IF(CONCATENATE($C$36,AC$3)=Matriz!$BE$18,CONCATENATE(Matriz!A$18,\" - P5 I5\"),\"\")","v":""},{"$f":"IF(CONCATENATE($C$36,AC$3)=Matriz!$BE$63,CONCATENATE(Matriz!A$63,\" - P5 I5\"),\"\")","v":""},{"$f":"IF(CONCATENATE($C$36,AC$3)=Matriz!$BE$108,CONCATENATE(Matriz!A$108,\" - P5 I5\"),\"\")","v":""},{"$f":"IF(CONCATENATE($C$36,AC$3)=Matriz!$BE$153,CONCATENATE(Matriz!A$153,\" - P5 I5\"),\"\")","v":""},null,{"$f":"IF(CONCATENATE($C$36,AC$3)=Matriz!$BE$198,CONCATENATE(Matriz!A$198,\" - P5 I5\"),\"\")","v":""},{"$nulls":5},9,22,198]
[{"$nulls":4},{"$f":"IF(CONCATENATE($C$36,E$3)=Matriz!$BE$27,CONCATENATE(Matriz!A$27,\" - P5 I1\"),\"\")","v":""},{"$f":"IF(CONCATENATE($C$36,E$3)=Matriz!$BE$72,CONCATENATE(Matriz!A$72,\" - P5 I1\"),\"\")","v":""},{"$f":"IF(CONCATENATE($C$36,E$3)=Matriz!$BE$117,CONCATENATE(Matriz!A$117,\" - P5 I1\"),\"\")","v":""},{"$f":"IF(CONCATENATE($C$36,E$3)=Matriz!$BE$162,CONCATENATE(Matriz!A$162,\" - P5 I1\"),\"\")","v":""},null,{"$f":"IF(CONCATENATE($C$36,E$3)=Matriz!$BE$207,CONCATENATE(Matriz!A$207,\" - P5 I1\"),\"\")","v":""},{"$f":"IF(CONCATENATE($C$36,K$3)=Matriz!$BE$27,CONCATENATE(Matriz!A$27,\" - P5 I2\"),\"\")","v":""},{"$f":"IF(CONCATENATE($C$36,K$3)=Matriz!$BE$72,CONCATENATE(Matriz!A$72,\" - P5 I2\"),\"\")","v":""},{"$f":"IF(CONCATENATE($C$36,K$3)=Matriz!$BE$117,CONCATENATE(Matriz!A$117,\" - P5 I2\"),\"\")","v":""},{"$f":"IF(CONCATENATE($C$36,K$3)=Matriz!$BE$162,CONCATENATE(Matriz!A$162,\" - P5 I2\"),\"\")","v":""},{"$f":"IF(CONCATENATE($C$36,K$3)=Matriz!$BE$207,CONCATENATE(Matriz!A$207,\" - P5 I2\"),\"\")","v":""},null,{"$f":"IF(CONCATENATE($C$36,Q$3)=Matriz!$BE$27,CONCATENATE(Matriz!A$27,\" - P5 I3\"),\"\")","v":""},{"$f":"IF(CONCATENATE($C$36,Q$3)=Matriz!$BE$72,CONCATENATE(Matriz!A$72,\" - P5 I3\"),\"\")","v":""},{"$f":"IF(CONCATENATE($C$36,Q$3)=Matriz!$BE$117,CONCATENATE(Matriz!A$117,\" - P5 I3\"),\"\")","v":""},{"$f":"IF(CONCATENATE($C$36,Q$3)=Matriz!$BE$162,CONCATENATE(Matriz!A$162,\" - P5 I3\"),\"\")","v":""},{"$f":"IF(CONCATENATE($C$36,Q$3)=Matriz!$BE$207,CONCATENATE(Matriz!A$207,\" - P5 I3\"),\"\")","v":""},null,{"$f":"IF(CONCATENATE($C$36,W$3)=Matriz!$BE$27,CONCATENATE(Matriz!A$27,\" - P5 I4\"),\"\")","v":""},{"$f":"IF(CONCATENATE($C$36,W$3)=Matriz!$BE$72,CONCATENATE(Matriz!A$72,\" - P5 I4\"),\"\")","v":""},{"$f":"IF(CONCATENATE($C$36,W$3)=Matriz!$BE$117,CONCATENATE(Matriz!A$117,\" - P5 I4\"),\"\")","v":""},{"$f":"IF(CONCATENATE($C$36,W$3)=Matriz!$BE$162,CONCATENATE(Matriz!A$162,\" - P5 I4\"),\"\")","v":""},{"$f":"IF(CONCATENATE($C$36,W$3)=Matriz!$BE$207,CONCATENATE(Matriz!A$207,\" - P5 I4\"),\"\")","v":""},null,{"$f":"IF(CONCATENATE($C$36,AC$3)=Matriz!$BE$27,CONCATENATE(Matriz!A$27,\" - P5 I5\"),\"\")","v":""},{"$f":"IF(CONCATENATE($C$36,AC$3)=Matriz!$BE$72,CONCATENATE(Matriz!A$72,\" - P5 I5\"),\"\")","v":""},{"$f":"IF(CONCATENATE($C$36,AC$3)=Matriz!$BE$117,CONCATENATE(Matriz!A$117,\" - P5 I5\"),\"\")","v":""},{"$f":"IF(CONCATENATE($C$36,AC$3)=Matriz!$BE$162,CONCATENATE(Matriz!A$162,\" - P5 I5\"),\"\")","v":""},null,{"$f":"IF(CONCATENATE($C$36,AC$3)=Matriz!$BE$207,CONCATENATE(Matriz!A$207,\" - P5 I5\"),\"\")","v":""},{"$nulls":5},9,23,207]
[{"$nulls":4},{"$f":"IF(CONCATENATE($C$36,E$3)=Matriz!$BE$36,CONCATENATE(Matriz!A$36,\" - P5 I1\"),\"\")","v":""},{"$f":"IF(CONCATENATE($C$36,E$3)=Matriz!$BE$81,CONCATENATE(Matriz!A$81,\" - P5 I1\"),\"\")","v":""},{"$f":"IF(CONCATENATE($C$36,E$3)=Matriz!$BE$126,CONCATENATE(Matriz!A$126,\" - P5 I1\"),\"\")","v":""},{"$f":"IF(CONCATENATE($C$36,E$3)=Matriz!$BE$171,CONCATENATE(Matriz!A$171,\" - P5 I1\"),\"\")","v":""},null,{"$f":"IF(CONCATENATE($C$36,E$3)=Matriz!$BE$216,CONCATENATE(Matriz!A$216,\" - P5 I1\"),\"\")","v":""},{"$f":"IF(CONCATENATE($C$36,K$3)=Matriz!$BE$36,CONCATENATE(Matriz!A$36,\" - P5 I2\"),\"\")","v":""},{"$f":"IF(CONCATENATE($C$36,K$3)=Matriz!$BE$81,CONCATENATE(Matriz!A$81,\" - P5 I2\"),\"\")","v":""},{"$f":"IF(CONCATENATE($C$36,K$3)=Matriz!$BE$126,CONCATENATE(Matriz!A$126,\" - P5 I2\"),\"\")","v":""},{"$f":"IF(CONCATENATE($C$36,K$3)=Matriz!$BE$171,CONCATENATE(Matriz!A$171,\" - P5 I2\"),\"\")","v":""},{"$f":"IF(CONCATENATE($C$36,K$3)=Matriz!$BE$216,CONCATENATE(Matriz!A$216,\" - P5 I2\"),\"\")","v":""},null,{"$f":"IF(CONCATENATE($C$36,Q$3)=Matriz!$BE$36,CONCATENATE(Matriz!A$36,\" - P5 I3\"),\"\")","v":""},{"$f":"IF(CONCATENATE($C$36,Q$3)=Matriz!$BE$81,CONCATENATE(Matriz!A$81,\" - P5 I3\"),\"\")","v":""},{"$f":"IF(CONCATENATE($C$36,Q$3)=Matriz!$BE$126,CONCATENATE(Matriz!A$126,\" - P5 I3\"),\"\")","v":""},{"$f":"IF(CONCATENATE($C$36,Q$3)=Matriz!$BE$171,CONCATENATE(Matriz!A$171,\" - P5 I3\"),\"\")","v":""},{"$f":"IF(CONCATENATE($C$36,Q$3)=Matriz!$BE$216,CONCATENATE(Matriz!A$216,\" - P5 I3\"),\"\")","v":""},null,{"$f":"IF(CONCATENATE($C$36,W$3)=Matriz!$BE$36,CONCATENATE(Matriz!A$36,\" - P5 I4\"),\"\")","v":""},{"$f":"IF(CONCATENATE($C$36,W$3)=Matriz!$BE$81,CONCATENATE(Matriz!A$81,\" - P5 I4\"),\"\")","v":""},{"$f":"IF(CONCATENATE($C$36,W$3)=Matriz!$BE$126,CONCATENATE(Matriz!A$126,\" - P5 I4\"),\"\")","v":"R14 - P5 I4"},{"$f":"IF(CONCATENATE($C$36,W$3)=Matriz!$BE$171,CONCATENATE(Matriz!A$171,\" - P5 I4\"),\"\")","v":""},{"$f":"IF(CONCATENATE($C$36,W$3)=Matriz!$BE$216,CONCATENATE(Matriz!A$216,\" - P5 I4\"),\"\")","v":""},null,{"$f":"IF(CONCATENATE($C$36,AC$3)=Matriz!$BE$36,CONCATENATE(Matriz!A$36,\" - P5 I5\"),\"\")","v":""},{"$f":"IF(CONCATENATE($C$36,AC$3)=Matriz!$BE$81,CONCATENATE(Matriz!A$81,\" - P5 I5\"),\"\")","v":""},{"$f":"IF(CONCATENATE($C$36,AC$3)=Matriz!$BE$126,CONCATENATE(Matriz!A$126,\" - P5 I5\"),\"\")","v":""},{"$f":"IF(CONCATENATE($C$36,AC$3)=Matriz!$BE$171,CONCATENATE(Matriz!A$171,\" - P5 I5\"),\"\")","v":""},null,{"$f":"IF(CONCATENATE($C$36,AC$3)=Matriz!$BE$216,CONCATENATE(Matriz!A$216,\" - P5 I5\"),\"\")","v":""},{"$nulls":5},9,24,216]
[{"$nulls":4},{"$f":"IF(CONCATENATE($C$36,E$3)=Matriz!$BE$45,CONCATENATE(Matriz!A$45,\" - P5 I1\"),\"\")","v":""},{"$f":"IF(CONCATENATE($C$36,E$3)=Matriz!$BE$90,CONCATENATE(Matriz!A$90,\" - P5 I1\"),\"\")","v":""},{"$f":"IF(CONCATENATE($C$36,E$3)=Matriz!$BE$135,CONCATENATE(Matriz!A$135,\" - P5 I1\"),\"\")","v":""},{"$f":"IF(CONCATENATE($C$36,E$3)=Matriz!$BE$180,CONCATENATE(Matriz!A$180,\" - P5 I1\"),\"\")","v":""},null,{"$f":"IF(CONCATENATE($C$36,E$3)=Matriz!$BE$225,CONCATENATE(Matriz!A$225,\" - P5 I1\"),\"\")","v":""},{"$f":"IF(CONCATENATE($C$36,K$3)=Matriz!$BE$45,CONCATENATE(Matriz!A$45,\" - P5 I2\"),\"\")","v":""},{"$f":"IF(CONCATENATE($C$36,K$3)=Matriz!$BE$90,CONCATENATE(Matriz!A$90,\" - P5 I2\"),\"\")","v":""},{"$f":"IF(CONCATENATE($C$36,K$3)=Matriz!$BE$135,CONCATENATE(Matriz!A$135,\" - P5 I2\"),\"\")","v":""},{"$f":"IF(CONCATENATE($C$36,K$3)=Matriz!$BE$180,CONCATENATE(Matriz!A$180,\" - P5 I2\"),\"\")","v":""},{"$f":"IF(CONCATENATE($C$36,K$3)=Matriz!$BE$225,CONCATENATE(Matriz!A$225,\" - P5 I2\"),\"\")","v":""},null,{"$f":"IF(CONCATENATE($C$36,Q$3)=Matriz!$BE$45,CONCATENATE(Matriz!A$45,\" - P5 I3\"),\"\")","v":""},{"$f":"IF(CONCATENATE($C$36,Q$3)=Matriz!$BE$90,CONCATENATE(Matriz!A$90,\" - P5 I3\"),\"\")","v":""},{"$f":"IF(CONCATENATE($C$36,Q$3)=Matriz!$BE$135,CONCATENATE(Matriz!A$135,\" - P5 I3\"),\"\")","v":""},{"$f":"IF(CONCATENATE($C$36,Q$3)=Matriz!$BE$180,CONCATENATE(Matriz!A$180,\" - P5 I3\"),\"\")","v":""},{"$f":"IF(CONCATENATE($C$36,Q$3)=Matriz!$BE$225,CONCATENATE(Matriz!A$225,\" - P5 I3\"),\"\")","v":""},null,{"$f":"IF(CONCATENATE($C$36,W$3)=Matriz!$BE$45,CONCATENATE(Matriz!A$45,\" - P5 I4\"),\"\")","v":""},{"$f":"IF(CONCATENATE($C$36,W$3)=Matriz!$BE$90,CONCATENATE(Matriz!A$90,\" - P5 I4\"),\"\")","v":""},{"$f":"IF(CONCATENATE($C$36,W$3)=Matriz!$BE$135,CONCATENATE(Matriz!A$135,\" - P5 I4\"),\"\")","v":""},{"$f":"IF(CONCATENATE($C$36,W$3)=Matriz!$BE$180,CONCATENATE(Matriz!A$180,\" - P5 I4\"),\"\")","v":""},{"$f":"IF(CONCATENATE($C$36,W$3)=Matriz!$BE$225,CONCATENATE(Matriz!A$225,\" - P5 I4\"),\"\")","v":""},null,{"$f":"IF(CONCATENATE($C$36,AC$3)=Matriz!$BE$45,CONCATENATE(Matriz!A$45,\" - P5 I5\"),\"\")","v":""},{"$f":"IF(CONCATENATE($C$36,AC$3)=Matriz!$BE$90,CONCATENATE(Matriz!A$90,\" - P5 I5\"),\"\")","v":""},{"$f":"IF(CONCATENATE($C$36,AC$3)=Matriz!$BE$135,CONCATENATE(Matriz!A$135,\" - P5 I5\"),\"\")","v":""},{"$f":"IF(CONCATENATE($C$36,AC$3)=Matriz!$BE$180,CONCATENATE(Matriz!A$180,\" - P5 I5\"),\"\")","v":""},null,{"$f":"IF(CONCATENATE($C$36,AC$3)=Matriz!$BE$225,CONCATENATE(Matriz!A$225,\" - P5 I5\"),\"\")","v":""},{"$nulls":5},9,25,225]
[]
[]
[{"$nulls":35},"MATRIZ DE RIESGO INHERENTE"]
{"$rows_empty":7}
[{"$nulls":36},"Zona de Riesgo Baja"]
[]
[]
[{"$nulls":36},"Zona de Riesgo Moderada"]
[]
[]
[{"$nulls":36},"Zona de Riesgo Alta"]
[]
[]
[{"$nulls":36},"Zona de Riesgo Extrema"]

{"sheet":"Mapa de riesgo consolidado","index":5,"n_rows":53,"n_cols":59,"rows_kept":53,"merged":[[40,57,40,58],[47,57,47,58]]}
[]
[]
[null,null,"Etiquetas de fila","Suma de Porcentaje"]
[null,null,"Zona de Riesgo alta",0.1282051282051282]
[null,null,{"v":0.1282051282051282,"d":"13%"},0.1282051282051282]
[null,null,"Zona de Riesgo baja",0]
[null,null,{"v":0,"d":"0%"},0]
[null,null,"Zona de Riesgo extrema",0.7692307692307693]
[null,null,{"v":0.7692307692307693,"d":"77%"},0.7692307692307693]
[null,null,"Zona de Riesgo moderada",0.10256410256410256]
[null,null,{"v":0.10256410256410256,"d":"10%"},0.10256410256410256]
[null,null,"Total general",1]
{"$rows_empty":10}
[null,null,"Suma de Identificados","Etiquetas de columna"]
[null,null,"Etiquetas de fila","Zona de Riesgo alta","Zona de Riesgo baja","Zona de Riesgo extrema","Zona de Riesgo moderada","Total general"]
[null,null,0,null,0,null,null,0]
[null,null,30,null,null,30,null,30]
[null,null,5,5,{"$nulls":3},5]
[null,null,4,{"$nulls":3},4,4]
[null,null,"Total general",5,0,30,4,39]
{"$rows_empty":11}
[{"$nulls":57},"Porcentaje de Riesgos por Proceso Evaluado"]
[{"$nulls":57},"Nivel","Porcentaje"]
[{"$nulls":57},"Zona de Riesgo extrema",{"$f":"BB$45","v":{"v":0.7692307692307693,"d":"77%"}}]
[null,"NIVEL","CANTIDAD","R1","R2","R3","R4","R5","R6","R7","R8","R9","R10","R11","R12","R13","R14","R15","R16","R17","R18","R19","R20","R21","R22","R23","R24","R25","R26","R27","R28","R29","R30","R31","R32","R33","R34","R35","R36","R37","R38","R39","R40","R41","R42","R43","R44","R45","R46","R47","R48","R49","R50","%",{"$nulls":3},"Zona de Riesgo alta",{"$f":"BB$46","v":{"v":0.1282051282051282,"d":"13%"}}]
[null,"Zona de riesgo extrema",{"$f":"SUM(D45:BA45)","v":30},{"$f":"IF(Matriz!N9=\"E\",1,0)","v":1},{"$f":"IF(Matriz!N18=\"E\",1,0)","v":1},{"$f":"IF(Matriz!N27=\"E\",1,0)","v":1},{"$f":"IF(Matriz!N36=\"E\",1,0)","v":1},{"$f":"IF(Matriz!N45=\"E\",1,0)","v":1},{"$f":"IF(Matriz!N54=\"E\",1,0)","v":1},{"$f":"IF(Matriz!N63=\"E\",1,0)","v":1},{"$f":"IF(Matriz!N72=\"E\",1,0)","v":1},{"$f":"IF(Matriz!N81=\"E\",1,0)","v":1},{"$f":"IF(Matriz!N90=\"E\",1,0)","v":1},{"$f":"IF(Matriz!N99=\"E\",1,0)","v":1},{"$f":"IF(Matriz!N108=\"E\",1,0)","v":1},{"$f":"IF(Matriz!N117=\"E\",1,0)","v":1},{"$f":"IF(Matriz!N126=\"E\",1,0)","v":1},{"$f":"IF(Matriz!N135=\"E\",1,0)","v":1},{"$f":"IF(Matriz!N144=\"E\",1,0)","v":1},{"$f":"IF(Matriz!N153=\"E\",1,0)","v":1},{"$f":"IF(Matriz!N162=\"E\",1,0)","v":0},{"$f":"IF(Matriz!N171=\"E\",1,0)","v":1},{"$f":"IF(Matriz!N180=\"E\",1,0)","v":0},{"$f":"IF(Matriz!N189=\"E\",1,0)","v":1},{"$f":"IF(Matriz!N198=\"E\",1,0)","v":1},{"$f":"IF(Matriz!N207=\"E\",1,0)","v":1},{"$f":"IF(Matriz!N216=\"E\",1,0)","v":1},{"$f":"IF(Matriz!N225=\"E\",1,0)","v":1},{"$f":"IF(Matriz!N234=\"E\",1,0)","v":0},{"$f":"IF(Matriz!N243=\"E\",1,0)","v":0},{"$f":"IF(Matriz!N252=\"E\",1,0)","v":1},{"$f":"IF(Matriz!N261=\"E\",1,0)","v":0},{"$f":"IF(Matriz!N270=\"E\",1,0)","v":1},{"$f":"IF(Matriz!N279=\"E\",1,0)","v":1},{"$f":"IF(Matriz!N288=\"E\",1,0)","v":1},{"$f":"IF(Matriz!N297=\"E\",1,0)","v":1},{"$f":"IF(Matriz!N306=\"E\",1,0)","v":1},{"$f":"IF(Matriz!N315=\"E\",1,0)","v":1},{"$f":"IF(Matriz!N324=\"E\",1,0)","v":0},{"$f":"IF(Matriz!N333=\"E\",1,0)","v":0},{"$f":"IF(Matriz!N342=\"E\",1,0)","v":0},{"$f":"IF(Matriz!N351=\"E\",1,0)","v":0},{"$f":"IF(Matriz!N360=\"E\",1,0)","v":0},{"$f":"IF(Matriz!N369=\"E\",1,0)","v":0},{"$f":"IF(Matriz!AE225=\"E\",1,0)","v":0},{"$f":"IF(Matriz!AF225=\"E\",1,0)","v":0},{"$f":"IF(Matriz!AG225=\"E\",1,0)","v":0},{"$f":"IF(Matriz!AH225=\"E\",1,0)","v":0},{"$f":"IF(Matriz!AI225=\"E\",1,0)","v":0},{"$f":"IF(Matriz!AQ225=\"E\",1,0)","v":0},{"$f":"IF(Matriz!AR225=\"E\",1,0)","v":0},{"$f":"IF(Matriz!AS225=\"E\",1,0)","v":0},{"$f":"IF(Matriz!AT225=\"E\",1,0)","v":0},{"$f":"C45/C49","v":{"v":0.7692307692307693,"d":"76.92%"}},{"$nulls":3},"Zona de Riesgo moderada",{"$f":"BB$47","v":{"v":0.10256410256410256,"d":"10%"}}]
[null,"Zona riesgo alta",{"$f":"SUM(D46:BA46)","v":5},{"$f":"IF(Matriz!$N9=\"A\",1,0)","v":0},{"$f":"IF(Matriz!$N18=\"A\",1,0)","v":0},{"$f":"IF(Matriz!$N27=\"A\",1,0)","v":0},{"$f":"IF(Matriz!$N36=\"A\",1,0)","v":0},{"$f":"IF(Matriz!$N45=\"A\",1,0)","v":0},{"$f":"IF(Matriz!$N54=\"A\",1,0)","v":0},{"$f":"IF(Matriz!N63=\"A\",1,0)","v":0},{"$f":"IF(Matriz!N72=\"A\",1,0)","v":0},{"$f":"IF(Matriz!N81=\"A\",1,0)","v":0},{"$f":"IF(Matriz!N90=\"A\",1,0)","v":0},{"$f":"IF(Matriz!N99=\"A\",1,0)","v":0},{"$f":"IF(Matriz!N108=\"A\",1,0)","v":0},{"$f":"IF(Matriz!N117=\"A\",1,0)","v":0},{"$f":"IF(Matriz!N126=\"A\",1,0)","v":0},{"$f":"IF(Matriz!N135=\"A\",1,0)","v":0},{"$f":"IF(Matriz!N144=\"A\",1,0)","v":0},{"$f":"IF(Matriz!N153=\"A\",1,0)","v":0},{"$f":"IF(Matriz!N162=\"A\",1,0)","v":1},{"$f":"IF(Matriz!N171=\"A\",1,0)","v":0},{"$f":"IF(Matriz!N180=\"A\",1,0)","v":1},{"$f":"IF(Matriz!N189=\"A\",1,0)","v":0},{"$f":"IF(Matriz!N198=\"A\",1,0)","v":0},{"$f":"IF(Matriz!N207=\"A\",1,0)","v":0},{"$f":"IF(Matriz!N216=\"A\",1,0)","v":0},{"$f":"IF(Matriz!N225=\"A\",1,0)","v":0},{"$f":"IF(Matriz!N234=\"A\",1,0)","v":1},{"$f":"IF(Matriz!N243=\"A\",1,0)","v":1},{"$f":"IF(Matriz!N252=\"A\",1,0)","v":0},{"$f":"IF(Matriz!N261=\"A\",1,0)","v":1},{"$f":"IF(Matriz!N270=\"A\",1,0)","v":0},{"$f":"IF(Matriz!N279=\"A\",1,0)","v":0},{"$f":"IF(Matriz!N288=\"A\",1,0)","v":0},{"$f":"IF(Matriz!N297=\"A\",1,0)","v":0},{"$f":"IF(Matriz!N306=\"A\",1,0)","v":0},{"$f":"IF(Matriz!N315=\"A\",1,0)","v":0},{"$f":"IF(Matriz!N324=\"A\",1,0)","v":0},{"$f":"IF(Matriz!N333=\"A\",1,0)","v":0},{"$f":"IF(Matriz!N342=\"A\",1,0)","v":0},{"$f":"IF(Matriz!N351=\"A\",1,0)","v":0},{"$f":"IF(Matriz!N360=\"A\",1,0)","v":0},{"$f":"IF(Matriz!N369=\"A\",1,0)","v":0},{"$f":"IF(Matriz!AE225=\"A\",1,0)","v":0},{"$f":"IF(Matriz!AF225=\"A\",1,0)","v":0},{"$f":"IF(Matriz!AG225=\"A\",1,0)","v":0},{"$f":"IF(Matriz!AH225=\"A\",1,0)","v":0},{"$f":"IF(Matriz!AI225=\"A\",1,0)","v":0},{"$f":"IF(Matriz!AQ225=\"A\",1,0)","v":0},{"$f":"IF(Matriz!AR225=\"A\",1,0)","v":0},{"$f":"IF(Matriz!AS225=\"A\",1,0)","v":0},{"$f":"IF(Matriz!AT225=\"A\",1,0)","v":0},{"$f":"C46/C49","v":{"v":0.1282051282051282,"d":"12.82%"}},{"$nulls":3},"Zona de Riesgo baja",{"$f":"BB$48","v":{"v":0,"d":"0%"}}]
[null,"Zona de riesgo moderada",{"$f":"SUM(D47:BA47)","v":4},{"$f":"IF(Matriz!$N9=\"M\",1,0)","v":0},{"$f":"IF(Matriz!$N18=\"M\",1,0)","v":0},{"$f":"IF(Matriz!$N27=\"M\",1,0)","v":0},{"$f":"IF(Matriz!$N36=\"M\",1,0)","v":0},{"$f":"IF(Matriz!$N45=\"M\",1,0)","v":0},{"$f":"IF(Matriz!N54=\"M\",1,0)","v":0},{"$f":"IF(Matriz!N63=\"M\",1,0)","v":0},{"$f":"IF(Matriz!N72=\"M\",1,0)","v":0},{"$f":"IF(Matriz!N81=\"M\",1,0)","v":0},{"$f":"IF(Matriz!N90=\"M\",1,0)","v":0},{"$f":"IF(Matriz!N99=\"M\",1,0)","v":0},{"$f":"IF(Matriz!N108=\"M\",1,0)","v":0},{"$f":"IF(Matriz!N117=\"M\",1,0)","v":0},{"$f":"IF(Matriz!N126=\"M\",1,0)","v":0},{"$f":"IF(Matriz!N135=\"M\",1,0)","v":0},{"$f":"IF(Matriz!N144=\"M\",1,0)","v":0},{"$f":"IF(Matriz!N153=\"M\",1,0)","v":0},{"$f":"IF(Matriz!N162=\"M\",1,0)","v":0},{"$f":"IF(Matriz!N171=\"M\",1,0)","v":0},{"$f":"IF(Matriz!N180=\"M\",1,0)","v":0},{"$f":"IF(Matriz!N189=\"M\",1,0)","v":0},{"$f":"IF(Matriz!N198=\"M\",1,0)","v":0},{"$f":"IF(Matriz!N207=\"M\",1,0)","v":0},{"$f":"IF(Matriz!N216=\"M\",1,0)","v":0},{"$f":"IF(Matriz!N225=\"M\",1,0)","v":0},{"$f":"IF(Matriz!N234=\"M\",1,0)","v":0},{"$f":"IF(Matriz!P243=\"M\",1,0)","v":0},{"$f":"IF(Matriz!N252=\"M\",1,0)","v":0},{"$f":"IF(Matriz!N261=\"M\",1,0)","v":0},{"$f":"IF(Matriz!N270=\"M\",1,0)","v":0},{"$f":"IF(Matriz!N279=\"M\",1,0)","v":0},{"$f":"IF(Matriz!N288=\"M\",1,0)","v":0},{"$f":"IF(Matriz!N297=\"M\",1,0)","v":0},{"$f":"IF(Matriz!N306=\"M\",1,0)","v":0},{"$f":"IF(Matriz!N315=\"M\",1,0)","v":0},{"$f":"IF(Matriz!N324=\"M\",1,0)","v":1},{"$f":"IF(Matriz!N333=\"M\",1,0)","v":1},{"$f":"IF(Matriz!N342=\"M\",1,0)","v":1},{"$f":"IF(Matriz!N351=\"M\",1,0)","v":1},{"$f":"IF(Matriz!N360=\"M\",1,0)","v":0},{"$f":"IF(Matriz!N369=\"M\",1,0)","v":0},{"$f":"IF(Matriz!AE225=\"M\",1,0)","v":0},{"$f":"IF(Matriz!AF225=\"M\",1,0)","v":0},{"$f":"IF(Matriz!AG225=\"M\",1,0)","v":0},{"$f":"IF(Matriz!AH225=\"M\",1,0)","v":0},{"$f":"IF(Matriz!AI225=\"M\",1,0)","v":0},{"$f":"IF(Matriz!AQ225=\"M\",1,0)","v":0},{"$f":"IF(Matriz!AR225=\"M\",1,0)","v":0},{"$f":"IF(Matriz!AS225=\"M\",1,0)","v":0},{"$f":"IF(Matriz!AT225=\"M\",1,0)","v":0},{"$f":"C47/C49","v":{"v":0.10256410256410256,"d":"10.26%"}}]
[null,"Zona de riesgo baja",{"$f":"SUM(D48:BA48)","v":0},{"$f":"IF(Matriz!$N9=\"B\",1,0)","v":0},{"$f":"IF(Matriz!$N18=\"B\",1,0)","v":0},{"$f":"IF(Matriz!$N27=\"B\",1,0)","v":0},{"$f":"IF(Matriz!$N36=\"B\",1,0)","v":0},{"$f":"IF(Matriz!$N45=\"B\",1,0)","v":0},{"$f":"IF(Matriz!N54=\"B\",1,0)","v":0},{"$f":"IF(Matriz!N63=\"B\",1,0)","v":0},{"$f":"IF(Matriz!N72=\"B\",1,0)","v":0},{"$f":"IF(Matriz!N81=\"B\",1,0)","v":0},{"$f":"IF(Matriz!N90=\"B\",1,0)","v":0},{"$f":"IF(Matriz!N99=\"B\",1,0)","v":0},{"$f":"IF(Matriz!N108=\"B\",1,0)","v":0},{"$f":"IF(Matriz!N117=\"B\",1,0)","v":0},{"$f":"IF(Matriz!N126=\"B\",1,0)","v":0},{"$f":"IF(Matriz!N135=\"B\",1,0)","v":0},{"$f":"IF(Matriz!N144=\"B\",1,0)","v":0},{"$f":"IF(Matriz!N153=\"B\",1,0)","v":0},{"$f":"IF(Matriz!N162=\"B\",1,0)","v":0},{"$f":"IF(Matriz!N171=\"B\",1,0)","v":0},{"$f":"IF(Matriz!N180=\"B\",1,0)","v":0},{"$f":"IF(Matriz!N189=\"B\",1,0)","v":0},{"$f":"IF(Matriz!N198=\"B\",1,0)","v":0},{"$f":"IF(Matriz!N207=\"B\",1,0)","v":0},{"$f":"IF(Matriz!N216=\"B\",1,0)","v":0},{"$f":"IF(Matriz!N225=\"B\",1,0)","v":0},{"$f":"IF(Matriz!N234=\"B\",1,0)","v":0},{"$f":"IF(Matriz!P243=\"B\",1,0)","v":0},{"$f":"IF(Matriz!N252=\"B\",1,0)","v":0},{"$f":"IF(Matriz!N261=\"B\",1,0)","v":0},{"$f":"IF(Matriz!N270=\"B\",1,0)","v":0},{"$f":"IF(Matriz!N279=\"B\",1,0)","v":0},{"$f":"IF(Matriz!N288=\"B\",1,0)","v":0},{"$f":"IF(Matriz!N297=\"B\",1,0)","v":0},{"$f":"IF(Matriz!N306=\"B\",1,0)","v":0},{"$f":"IF(Matriz!N315=\"B\",1,0)","v":0},{"$f":"IF(Matriz!N324=\"B\",1,0)","v":0},{"$f":"IF(Matriz!N333=\"B\",1,0)","v":0},{"$f":"IF(Matriz!N342=\"B\",1,0)","v":0},{"$f":"IF(Matriz!N351=\"B\",1,0)","v":0},{"$f":"IF(Matriz!N360=\"B\",1,0)","v":0},{"$f":"IF(Matriz!N369=\"B\",1,0)","v":0},{"$f":"IF(Matriz!AE225=\"B\",1,0)","v":0},{"$f":"IF(Matriz!AF225=\"B\",1,0)","v":0},{"$f":"IF(Matriz!AG225=\"B\",1,0)","v":0},{"$f":"IF(Matriz!AH225=\"B\",1,0)","v":0},{"$f":"IF(Matriz!AI225=\"B\",1,0)","v":0},{"$f":"IF(Matriz!AQ225=\"B\",1,0)","v":0},{"$f":"IF(Matriz!AR225=\"B\",1,0)","v":0},{"$f":"IF(Matriz!AS225=\"B\",1,0)","v":0},{"$f":"IF(Matriz!AT225=\"B\",1,0)","v":0},{"$f":"C48/C49","v":{"v":0,"d":"0.00%"}},{"$nulls":3},"Cantidad de Riesgos Identificados"]
[null,"Total",{"$f":"SUM(C45:C48)","v":39},{"$nulls":50},{"$f":"SUM(BB45:BB48)","v":{"v":1,"d":"100.00%"}},{"$nulls":3},"Nivel","Identificados"]
[{"$nulls":57},"Zona de Riesgo extrema",{"$f":"C45","v":30}]
[{"$nulls":57},"Zona de Riesgo alta",{"$f":"C46","v":5}]
[{"$nulls":57},"Zona de Riesgo moderada",{"$f":"C47","v":4}]
[{"$nulls":57},"Zona de Riesgo baja",{"$f":"C48","v":0}]